=> Bootstrap dependency digest>=20010302: found digest-20190127
===> Skipping vulnerability checks.
WARNING: No /var/db/pkg/pkg-vulnerabilities file found.
WARNING: To fix run: `/usr/sbin/pkg_admin -K /var/db/pkg fetch-pkg-vulnerabilities'.
===> Building for freeradius-pgsql-3.0.21
sh: cannot create build/tests/keywords/autoconf.h.mk: directory nonexistent
HEADER src/include/features.h
HEADER src/include/attributes.h
CC jlibtool.c
HEADER src/include/rfc2867.h
HEADER src/include/rfc3162.h
HEADER src/include/rfc5090.h
HEADER src/include/rfc5904.h
HEADER src/include/rfc8559.h
HEADER src/include/rfc4818.h
HEADER src/include/rfc4675.h
HEADER src/include/rfc6929.h
HEADER src/include/rfc4849.h
HEADER src/include/rfc2869.h
HEADER src/include/rfc6930.h
HEADER src/include/rfc6677.h
HEADER src/include/rfc5447.h
HEADER src/include/rfc7268.h
HEADER src/include/rfc7155.h
HEADER src/include/rfc6519.h
HEADER src/include/rfc7499.h
HEADER src/include/rfc8045.h
HEADER src/include/rfc5176.h
HEADER src/include/rfc2866.h
HEADER src/include/rfc2868.h
HEADER src/include/rfc3580.h
HEADER src/include/rfc5580.h
HEADER src/include/rfc4372.h
HEADER src/include/rfc4679.h
HEADER src/include/rfc7055.h
HEADER src/include/rfc6572.h
HEADER src/include/rfc4072.h
HEADER src/include/rfc4603.h
HEADER src/include/rfc2865.h
HEADER src/include/rfc6911.h
HEADER src/include/rfc7930.h
HEADER src/include/rfc5607.h
HEADER src/include/rfc3576.h
HEADER src/include/vqp.h
HEADER src/include/freeradius.h
INSTALL raddb/sites-enabled
INSTALL raddb/mods-enabled
HEADER src/include/missing.h
HEADER src/include/tls.h
LN-S raddb/mods-enabled/always
LN-S raddb/mods-enabled/attr_filter
LN-S raddb/mods-enabled/cache_eap
LN-S raddb/mods-enabled/chap
LN-S raddb/mods-enabled/date
LN-S raddb/mods-enabled/detail
LN-S raddb/mods-enabled/detail.log
LN-S raddb/mods-enabled/digest
LN-S raddb/mods-enabled/dynamic_clients
LN-S raddb/mods-enabled/eap
LN-S raddb/mods-enabled/echo
LN-S raddb/mods-enabled/exec
LN-S raddb/mods-enabled/expiration
LN-S raddb/mods-enabled/expr
LN-S raddb/mods-enabled/files
LN-S raddb/mods-enabled/linelog
LN-S raddb/mods-enabled/logintime
LN-S raddb/mods-enabled/mschap
LN-S raddb/mods-enabled/pap
LN-S raddb/mods-enabled/passwd
LN-S raddb/mods-enabled/ntlm_auth
LN-S raddb/mods-enabled/preprocess
LN-S raddb/mods-enabled/radutmp
LN-S raddb/mods-enabled/realm
LN-S raddb/mods-enabled/replicate
LN-S raddb/mods-enabled/soh
LN-S raddb/mods-enabled/sradutmp
LN-S raddb/mods-enabled/unix
LN-S raddb/mods-enabled/unpack
LN-S raddb/mods-enabled/utf8
CC src/lib/cbuff.c
CC src/lib/cursor.c
CC src/lib/dict.c
CC src/lib/debug.c
src/lib/debug.c: In function 'fr_fault_setup':
src/lib/debug.c:1070:4: warning: 'talloc_autofree_context' is deprecated [-Wdeprecated-declarations]
    talloc_autofree_ctx = talloc_autofree_context();
    ^
In file included from src/freeradius-devel/libradius.h:60:0,
                 from src/lib/debug.c:25:
/usr/pkg/include/talloc.h:1071:16: note: declared here
 _PUBLIC_ void *talloc_autofree_context(void) _DEPRECATED_;
                ^
CC src/lib/filters.c
CC src/lib/hash.c
CC src/lib/hmacmd5.c
CC src/lib/hmacsha1.c
CC src/lib/isaac.c
CC src/lib/log.c
CC src/lib/misc.c
CC src/lib/missing.c
CC src/lib/md4.c
CC src/lib/md5.c
CC src/lib/net.c
CC src/lib/pair.c
CC src/lib/pcap.c
CC src/lib/print.c
CC src/lib/radius.c
CC src/lib/rbtree.c
CC src/lib/regex.c
CC src/lib/sha1.c
CC src/lib/snprintf.c
CC src/lib/strlcat.c
CC src/lib/strlcpy.c
CC src/lib/socket.c
CC src/lib/token.c
CC src/lib/udpfromto.c
CC src/lib/value.c
CC src/lib/fifo.c
CC src/lib/packet.c
CC src/lib/event.c
src/lib/event.c: In function 'fr_event_loop':
src/lib/event.c:660:24: warning: initialization makes pointer from integer without a cast [-Wint-conversion]
    fr_event_fd_t *ef = el->events[i].udata;
                        ^
CC src/lib/getaddrinfo.c
CC src/lib/heap.c
CC src/lib/tcp.c
CC src/lib/base64.c
CC src/lib/version.c
CC src/lib/atomic_queue.c
CC src/modules/rlm_always/rlm_always.c
CC src/modules/rlm_attr_filter/rlm_attr_filter.c
CC src/modules/rlm_cache/rlm_cache.c
CC src/modules/rlm_cache/drivers/rlm_cache_rbtree/rlm_cache_rbtree.c
CC src/modules/rlm_chap/rlm_chap.c
CC src/modules/rlm_counter/rlm_counter.c
CC src/modules/rlm_cram/rlm_cram.c
CC src/modules/rlm_date/rlm_date.c
CC src/modules/rlm_detail/rlm_detail.c
CC src/modules/rlm_digest/rlm_digest.c
CC src/modules/rlm_dynamic_clients/rlm_dynamic_clients.c
CC src/modules/rlm_eap/libeap/eapcommon.c
CC src/modules/rlm_eap/libeap/eapcrypto.c
CC src/modules/rlm_eap/libeap/eap_chbind.c
CC src/modules/rlm_eap/libeap/eapsimlib.c
CC src/modules/rlm_eap/libeap/fips186prf.c
CC src/modules/rlm_eap/libeap/comp128.c
CC src/modules/rlm_eap/libeap/eap_tls.c
CC src/modules/rlm_eap/libeap/mppe_keys.c
CC src/modules/rlm_eap/rlm_eap.c
CC src/modules/rlm_eap/eap.c
CC src/modules/rlm_eap/mem.c
CC src/modules/rlm_eap/types/rlm_eap_fast/rlm_eap_fast.c
CC src/modules/rlm_eap/types/rlm_eap_fast/eap_fast.c
CC src/modules/rlm_eap/types/rlm_eap_fast/eap_fast_crypto.c
CC src/modules/rlm_eap/types/rlm_eap_gtc/rlm_eap_gtc.c
CC src/modules/rlm_eap/types/rlm_eap_leap/rlm_eap_leap.c
CC src/modules/rlm_eap/types/rlm_eap_leap/eap_leap.c
CC src/modules/rlm_eap/types/rlm_eap_leap/smbdes.c
CC src/modules/rlm_eap/types/rlm_eap_md5/rlm_eap_md5.c
CC src/modules/rlm_eap/types/rlm_eap_md5/eap_md5.c
CC src/modules/rlm_eap/types/rlm_eap_mschapv2/rlm_eap_mschapv2.c
CC src/modules/rlm_eap/types/rlm_eap_peap/rlm_eap_peap.c
CC src/modules/rlm_eap/types/rlm_eap_peap/peap.c
CC src/modules/rlm_eap/types/rlm_eap_pwd/rlm_eap_pwd.c
CC src/modules/rlm_eap/types/rlm_eap_pwd/eap_pwd.c
CC src/modules/rlm_eap/types/rlm_eap_sim/rlm_eap_sim.c
CC src/modules/rlm_eap/types/rlm_eap_tls/rlm_eap_tls.c
CC src/modules/rlm_eap/types/rlm_eap_ttls/rlm_eap_ttls.c
CC src/modules/rlm_eap/types/rlm_eap_ttls/ttls.c
CC src/modules/rlm_eap/radeapclient.c
CC src/main/files.c
CC src/main/threads.c
CC src/main/version.c
CC src/main/cb.c
CC src/main/tls.c
CC src/main/conffile.c
CC src/main/evaluate.c
CC src/main/exec.c
CC src/main/exfile.c
CC src/main/log.c
CC src/main/parser.c
CC src/main/map.c
CC src/main/regex.c
CC src/main/tmpl.c
CC src/main/util.c
CC src/main/pair.c
CC src/main/xlat.c
CC src/modules/rlm_exec/rlm_exec.c
CC src/modules/rlm_expiration/rlm_expiration.c
CC src/modules/rlm_expr/rlm_expr.c
CC src/modules/rlm_expr/paircmp.c
CC src/modules/rlm_files/rlm_files.c
CC src/modules/rlm_ippool/rlm_ippool.c
CC src/modules/rlm_ippool/rlm_ippool_tool.c
CC src/modules/rlm_krb5/rlm_krb5.c
CC src/modules/rlm_krb5/krb5.c
CC src/modules/rlm_ldap/rlm_ldap.c
In file included from src/modules/rlm_krb5/rlm_krb5.c:32:0:
src/modules/rlm_krb5/krb5.h:86:25: fatal error: com_err.h: No such file or directory
compilation terminated.
gmake: *** [scripts/boiler.mk:635: build/objs/src/modules/rlm_krb5/rlm_krb5.lo] Error 1
gmake: *** Waiting for unfinished jobs....
In file included from src/modules/rlm_krb5/krb5.c:28:0:
src/modules/rlm_krb5/krb5.h:86:25: fatal error: com_err.h: No such file or directory
compilation terminated.
gmake: *** [scripts/boiler.mk:635: build/objs/src/modules/rlm_krb5/krb5.lo] Error 1
*** Error code 2

Stop.
make[1]: stopped in /tree/pkgsrc/net/freeradius-pgsql
*** Error code 1

Stop.
make: stopped in /tree/pkgsrc/net/freeradius-pgsql