=> Bootstrap dependency digest>=20010302: found digest-20190127
===> Skipping vulnerability checks.
WARNING: No /var/db/pkg/pkg-vulnerabilities file found.
WARNING: To fix run: `/usr/sbin/pkg_admin -K /var/db/pkg fetch-pkg-vulnerabilities'.
===> Building for cantor-20.04.1nb8
Scanning dependencies of target po-et-docs-cantor-index-cache-bz2
Scanning dependencies of target po-ru-docs-cantor-index-cache-bz2
Scanning dependencies of target pofiles-54f36102731e0e98086531b117734770
Scanning dependencies of target po-es-docs-cantor-index-cache-bz2
[  0%] Generating po/et/docs/cantor/index.cache.bz2
[  0%] Generating po/ru/docs/cantor/index.cache.bz2
[  1%] Generating po/es/docs/cantor/index.cache.bz2
[  2%] Generating mo...
[  2%] Built target pofiles-54f36102731e0e98086531b117734770
Scanning dependencies of target po-de-docs-cantor-index-cache-bz2
[  2%] Generating po/de/docs/cantor/index.cache.bz2
[  2%] Built target po-ru-docs-cantor-index-cache-bz2
[  2%] Built target po-et-docs-cantor-index-cache-bz2
Scanning dependencies of target tsfiles-54f36102731e0e98086531b117734770
[  2%] Built target po-es-docs-cantor-index-cache-bz2
Scanning dependencies of target po-gl-docs-cantor-index-cache-bz2
[  3%] Generating ts...
Scanning dependencies of target po-ca-docs-cantor-index-cache-bz2
[  3%] Generating po/gl/docs/cantor/index.cache.bz2
[  3%] Generating po/ca/docs/cantor/index.cache.bz2
[  3%] Built target tsfiles-54f36102731e0e98086531b117734770
Scanning dependencies of target po-fr-docs-cantor-index-cache-bz2
[  3%] Generating po/fr/docs/cantor/index.cache.bz2
[  3%] Built target po-de-docs-cantor-index-cache-bz2
Scanning dependencies of target po-it-docs-cantor-index-cache-bz2
[  4%] Generating po/it/docs/cantor/index.cache.bz2
[  4%] Built target po-gl-docs-cantor-index-cache-bz2
Scanning dependencies of target po-nl-docs-cantor-index-cache-bz2
[  4%] Built target po-ca-docs-cantor-index-cache-bz2
[  4%] Generating po/nl/docs/cantor/index.cache.bz2
Scanning dependencies of target po-pt-docs-cantor-index-cache-bz2
[  5%] Generating po/pt/docs/cantor/index.cache.bz2
[  5%] Built target po-fr-docs-cantor-index-cache-bz2
Scanning dependencies of target po-pt-BR-docs-cantor-index-cache-bz2
[  5%] Generating po/pt_BR/docs/cantor/index.cache.bz2
[  5%] Built target po-it-docs-cantor-index-cache-bz2
I/O warning : failed to load external entity "/usr/pkg/share/kf5/kdoctools/customization/xsl/pt-BR.xml"
Scanning dependencies of target po-sv-docs-cantor-index-cache-bz2
No "pt_br" localization of "footer-doc-comment" exists; using "en".
No "pt_br" localization of "footer-doc-feedback" exists; using "en".
No "pt_br" localization of "footer-doc-teamname" exists; using "en".
No "pt_br" localization of "footer-doc-comment" exists; using "en".
No "pt_br" localization of "footer-doc-feedback" exists; using "en".
No "pt_br" localization of "footer-doc-teamname" exists; using "en".
[  5%] Generating po/sv/docs/cantor/index.cache.bz2
No "pt_br" localization of "footer-doc-comment" exists; using "en".
No "pt_br" localization of "footer-doc-feedback" exists; using "en".
No "pt_br" localization of "footer-doc-teamname" exists; using "en".
No "pt_br" localization of "footer-doc-comment" exists; using "en".
No "pt_br" localization of "footer-doc-feedback" exists; using "en".
No "pt_br" localization of "footer-doc-teamname" exists; using "en".
[  5%] Built target po-nl-docs-cantor-index-cache-bz2
No "pt_br" localization of "footer-doc-comment" exists; using "en".
No "pt_br" localization of "footer-doc-feedback" exists; using "en".
No "pt_br" localization of "footer-doc-teamname" exists; using "en".
No "pt_br" localization of "footer-doc-comment" exists; using "en".
No "pt_br" localization of "footer-doc-feedback" exists; using "en".
No "pt_br" localization of "footer-doc-teamname" exists; using "en".
No "pt_br" localization of "footer-doc-comment" exists; using "en".
No "pt_br" localization of "footer-doc-feedback" exists; using "en".
No "pt_br" localization of "footer-doc-teamname" exists; using "en".
No "pt_br" localization of "footer-doc-comment" exists; using "en".
No "pt_br" localization of "footer-doc-feedback" exists; using "en".
No "pt_br" localization of "footer-doc-teamname" exists; using "en".
Scanning dependencies of target po-uk-docs-cantor-index-cache-bz2
No "pt_br" localization of "footer-doc-comment" exists; using "en".
No "pt_br" localization of "footer-doc-feedback" exists; using "en".
No "pt_br" localization of "footer-doc-teamname" exists; using "en".
No "pt_br" localization of "footer-doc-comment" exists; using "en".
No "pt_br" localization of "footer-doc-feedback" exists; using "en".
No "pt_br" localization of "footer-doc-teamname" exists; using "en".
No "pt_br" localization of "footer-doc-comment" exists; using "en".
No "pt_br" localization of "footer-doc-feedback" exists; using "en".
No "pt_br" localization of "footer-doc-teamname" exists; using "en".
No "pt_br" localization of "footer-doc-comment" exists; using "en".
No "pt_br" localization of "footer-doc-feedback" exists; using "en".
No "pt_br" localization of "footer-doc-teamname" exists; using "en".
No "pt_br" localization of "footer-doc-comment" exists; using "en".
No "pt_br" localization of "footer-doc-feedback" exists; using "en".
No "pt_br" localization of "footer-doc-teamname" exists; using "en".
[  5%] Built target po-pt-docs-cantor-index-cache-bz2
[  5%] Generating po/uk/docs/cantor/index.cache.bz2
Scanning dependencies of target discount_project
[  5%] Built target po-pt-BR-docs-cantor-index-cache-bz2
[  5%] Creating directories for 'discount_project'
Scanning dependencies of target doc-index-cache-bz2
[  6%] Generating index.cache.bz2
[  6%] Performing download step (DIR copy) for 'discount_project'
[  7%] No update step for 'discount_project'
[  7%] No patch step for 'discount_project'
[  7%] Built target po-sv-docs-cantor-index-cache-bz2
[  7%] Performing configure step for 'discount_project'
Scanning dependencies of target cantor_config_autogen
[  7%] Built target po-uk-docs-cantor-index-cache-bz2
loading initial cache file /work/math/cantor/work/cantor-20.04.1/_KDE_build/thirdparty/tmp/discount_project-cache-.cmake
[  7%] Automatic MOC for target cantor_config
Scanning dependencies of target cantorlibs_autogen
[  8%] Generating cantor_assistant.json
Unknown property type for key "X-KDE-ServiceType" -> falling back to string
Generated  "/work/math/cantor/work/cantor-20.04.1/_KDE_build/src/lib/cantor_assistant.json"
[  8%] Built target cantor_config_autogen
[  8%] Generating cantor_backend.json
[  8%] Built target doc-index-cache-bz2
Unknown property type for key "X-KDE-ServiceType" -> falling back to string
Generated  "/work/math/cantor/work/cantor-20.04.1/_KDE_build/src/lib/cantor_backend.json"
Scanning dependencies of target cantor_qalculatebackend_autogen
Scanning dependencies of target cantor_scripteditor_autogen
[  8%] Generating cantor_panelplugin.json
[  8%] Automatic MOC for target cantor_qalculatebackend
-- The C compiler identification is GNU 7.5.0
Unknown property type for key "X-KDE-ServiceType" -> falling back to string
Generated  "/work/math/cantor/work/cantor-20.04.1/_KDE_build/src/lib/cantor_panelplugin.json"
[  8%] Automatic MOC for target cantor_scripteditor
-- Detecting C compiler ABI info
[  8%] Automatic MOC for target cantorlibs
-- Detecting C compiler ABI info - done
-- Check for working C compiler: /work/math/cantor/work/.cwrapper/bin/gcc - skipped
-- Detecting C compile features
-- Detecting C compile features - done
-- Looking for libgen.h
-- Looking for libgen.h - found
-- Looking for pwd.h
[  8%] Built target cantor_scripteditor_autogen
Scanning dependencies of target cantor_pythonbackend_autogen
-- Looking for pwd.h - found
-- Looking for alloca.h
[  8%] Automatic MOC for target cantor_pythonbackend
-- Looking for alloca.h - not found
-- Looking for malloc.h
-- Looking for malloc.h - found
-- Looking for sys/stat.h
[  8%] Built target cantor_qalculatebackend_autogen
Scanning dependencies of target cantor_pythonserver_autogen
[  8%] Automatic MOC for target cantor_pythonserver
-- Looking for sys/stat.h - found
-- Check size of unsigned long
[  8%] Built target cantor_pythonserver_autogen
Scanning dependencies of target cantor_runscriptassistant_autogen
[  8%] Automatic MOC for target cantor_runscriptassistant
-- Check size of unsigned long - done
-- Check size of unsigned int
[  8%] Built target cantor_pythonbackend_autogen
[  8%] Generating settings.h, settings.cpp
Scanning dependencies of target cantor_config
[  8%] Building CXX object src/CMakeFiles/cantor_config.dir/cantor_config_autogen/mocs_compilation.cpp.o
-- Check size of unsigned int - done
-- Check size of unsigned short
[  8%] Building CXX object src/CMakeFiles/cantor_config.dir/settings.cpp.o
[  8%] Built target cantorlibs_autogen
[  8%] Built target cantor_runscriptassistant_autogen
Scanning dependencies of target cantor_pythonserver
[  8%] Building CXX object src/backends/python/CMakeFiles/cantor_pythonserver.dir/cantor_pythonserver_autogen/mocs_compilation.cpp.o
Scanning dependencies of target cantor_scripteditor
-- Check size of unsigned short - done
-- Looking for bzero
[  8%] Building CXX object src/scripteditor/CMakeFiles/cantor_scripteditor.dir/cantor_scripteditor_autogen/mocs_compilation.cpp.o
[  8%] Building CXX object src/backends/python/CMakeFiles/cantor_pythonserver.dir/pythonservermain.cpp.o
-- Looking for bzero - found
-- Looking for strcasecmp
-- Looking for strcasecmp - found
-- Looking for _stricmp
-- Looking for _stricmp - not found
-- Looking for strncasecmp
[  9%] Building CXX object src/backends/python/CMakeFiles/cantor_pythonserver.dir/pythonserver.cpp.o
-- Looking for strncasecmp - found
-- Looking for _strnicmp
-- Looking for _strnicmp - not found
-- Looking for random
-- Looking for random - found
-- Looking for srandom
In file included from /work/math/cantor/work/.buildlink/include/python3.8/abstract.h:837:0,
                 from /work/math/cantor/work/.buildlink/include/python3.8/Python.h:147,
                 from /work/math/cantor/work/cantor-20.04.1/src/backends/python/pythonserver.cpp:24:
/work/math/cantor/work/.buildlink/include/python3.8/cpython/abstract.h: In function 'PyObject* _PyObject_Vectorcall(PyObject*, PyObject* const*, size_t, PyObject*)':
/work/math/cantor/work/.buildlink/include/python3.8/cpython/abstract.h:128:55: warning: zero as null pointer constant [-Wzero-as-null-pointer-constant]
     return _Py_CheckFunctionResult(callable, res, NULL);
                                                       ^
/work/math/cantor/work/.buildlink/include/python3.8/cpython/abstract.h: In function 'PyObject* _PyObject_FastCall(PyObject*, PyObject* const*, Py_ssize_t)':
/work/math/cantor/work/.buildlink/include/python3.8/cpython/abstract.h:147:64: warning: zero as null pointer constant [-Wzero-as-null-pointer-constant]
     return _PyObject_Vectorcall(func, args, (size_t)nargs, NULL);
                                                                ^
/work/math/cantor/work/.buildlink/include/python3.8/cpython/abstract.h: In function 'PyObject* _PyObject_CallNoArg(PyObject*)':
/work/math/cantor/work/.buildlink/include/python3.8/cpython/abstract.h:153:52: warning: zero as null pointer constant [-Wzero-as-null-pointer-constant]
     return _PyObject_Vectorcall(func, NULL, 0, NULL);
                                                    ^
/work/math/cantor/work/.buildlink/include/python3.8/cpython/abstract.h:153:52: warning: zero as null pointer constant [-Wzero-as-null-pointer-constant]
In file included from /work/math/cantor/work/.buildlink/include/python3.8/Python.h:139:0,
                 from /work/math/cantor/work/cantor-20.04.1/src/backends/python/pythonserver.cpp:24:
/work/math/cantor/work/cantor-20.04.1/src/backends/python/pythonserver.cpp: In member function 'void PythonServer::runPythonCommand(const string&)':
/work/math/cantor/work/.buildlink/include/python3.8/pythonrun.h:169:62: warning: zero as null pointer constant [-Wzero-as-null-pointer-constant]
 #define PyRun_SimpleString(s) PyRun_SimpleStringFlags(s, NULL)
                                                              ^
/work/math/cantor/work/cantor-20.04.1/src/backends/python/pythonserver.cpp:71:5: note: in expansion of macro 'PyRun_SimpleString'
     PyRun_SimpleString(prepareCommand);
     ^~~~~~~~~~~~~~~~~~
/work/math/cantor/work/.buildlink/include/python3.8/pythonrun.h:102:80: warning: zero as null pointer constant [-Wzero-as-null-pointer-constant]
 #define Py_CompileString(str, p, s) Py_CompileStringExFlags(str, p, s, NULL, -1)
                                                                                ^
/work/math/cantor/work/cantor-20.04.1/src/backends/python/pythonserver.cpp:74:25: note: in expansion of macro 'Py_CompileString'
     PyObject* compile = Py_CompileString(command.c_str(), filePath.c_str(), Py_single_input);
                         ^~~~~~~~~~~~~~~~
/work/math/cantor/work/.buildlink/include/python3.8/pythonrun.h:102:80: warning: zero as null pointer constant [-Wzero-as-null-pointer-constant]
 #define Py_CompileString(str, p, s) Py_CompileStringExFlags(str, p, s, NULL, -1)
                                                                                ^
/work/math/cantor/work/cantor-20.04.1/src/backends/python/pythonserver.cpp:82:19: note: in expansion of macro 'Py_CompileString'
         compile = Py_CompileString(command.c_str(), filePath.c_str(), Py_file_input);
                   ^~~~~~~~~~~~~~~~
/work/math/cantor/work/cantor-20.04.1/src/backends/python/pythonserver.cpp: In member function 'void PythonServer::setFilePath(const string&, const string&)':
/work/math/cantor/work/.buildlink/include/python3.8/pythonrun.h:169:62: warning: zero as null pointer constant [-Wzero-as-null-pointer-constant]
 #define PyRun_SimpleString(s) PyRun_SimpleStringFlags(s, NULL)
                                                              ^
/work/math/cantor/work/cantor-20.04.1/src/backends/python/pythonserver.cpp:153:5: note: in expansion of macro 'PyRun_SimpleString'
     PyRun_SimpleString(("import sys; sys.argv = ['" + path + "']").c_str());
     ^~~~~~~~~~~~~~~~~~
/work/math/cantor/work/.buildlink/include/python3.8/pythonrun.h:169:62: warning: zero as null pointer constant [-Wzero-as-null-pointer-constant]
 #define PyRun_SimpleString(s) PyRun_SimpleStringFlags(s, NULL)
                                                              ^
/work/math/cantor/work/cantor-20.04.1/src/backends/python/pythonserver.cpp:156:9: note: in expansion of macro 'PyRun_SimpleString'
         PyRun_SimpleString("import sys; sys.path.insert(0, '')");
         ^~~~~~~~~~~~~~~~~~
/work/math/cantor/work/.buildlink/include/python3.8/pythonrun.h:169:62: warning: zero as null pointer constant [-Wzero-as-null-pointer-constant]
 #define PyRun_SimpleString(s) PyRun_SimpleStringFlags(s, NULL)
                                                              ^
/work/math/cantor/work/cantor-20.04.1/src/backends/python/pythonserver.cpp:161:9: note: in expansion of macro 'PyRun_SimpleString'
         PyRun_SimpleString(("import sys; sys.path.insert(0, '" + dir + "')").c_str());
         ^~~~~~~~~~~~~~~~~~
/work/math/cantor/work/.buildlink/include/python3.8/pythonrun.h:169:62: warning: zero as null pointer constant [-Wzero-as-null-pointer-constant]
 #define PyRun_SimpleString(s) PyRun_SimpleStringFlags(s, NULL)
                                                              ^
/work/math/cantor/work/cantor-20.04.1/src/backends/python/pythonserver.cpp:162:9: note: in expansion of macro 'PyRun_SimpleString'
         PyRun_SimpleString(("__file__ = '"+path+"'").c_str());
         ^~~~~~~~~~~~~~~~~~
/work/math/cantor/work/cantor-20.04.1/src/backends/python/pythonserver.cpp: In member function 'std::__cxx11::string PythonServer::variables(bool) const':
/work/math/cantor/work/cantor-20.04.1/src/backends/python/pythonserver.cpp:179:5: warning: zero as null pointer constant [-Wzero-as-null-pointer-constant]
     );
     ^
In file included from /work/math/cantor/work/.buildlink/include/python3.8/Python.h:139:0,
                 from /work/math/cantor/work/cantor-20.04.1/src/backends/python/pythonserver.cpp:24:
/work/math/cantor/work/.buildlink/include/python3.8/pythonrun.h:169:62: warning: zero as null pointer constant [-Wzero-as-null-pointer-constant]
 #define PyRun_SimpleString(s) PyRun_SimpleStringFlags(s, NULL)
                                                              ^
/work/math/cantor/work/cantor-20.04.1/src/backends/python/pythonserver.cpp:181:5: note: in expansion of macro 'PyRun_SimpleString'
     PyRun_SimpleString("__tmp_globals__ = globals()");
     ^~~~~~~~~~~~~~~~~~
/work/math/cantor/work/cantor-20.04.1/src/backends/python/pythonserver.cpp:224:5: warning: zero as null pointer constant [-Wzero-as-null-pointer-constant]
     );
     ^
-- Looking for srandom - found
-- Looking for getpwuid
[  9%] Linking CXX executable cantor_pythonserver
[  9%] Built target cantor_pythonserver
-- Looking for getpwuid - found
-- Looking for basename
[  9%] Generating settings.h, settings.cpp
[ 10%] Generating ui_axisrange.h
[ 10%] Generating ui_plottitle.h
-- Looking for basename - found
-- Looking for fchdir
-- Looking for fchdir - found
-- Looking for S_ISCHR
Scanning dependencies of target cantorlibs
[ 10%] Building CXX object src/scripteditor/CMakeFiles/cantor_scripteditor.dir/main.cpp.o
-- Looking for S_ISCHR - found
-- Looking for S_ISFIFO
[ 10%] Building CXX object src/lib/CMakeFiles/cantorlibs.dir/cantorlibs_autogen/mocs_compilation.cpp.o
[ 11%] Linking CXX shared library libcantor_config.so
-- Looking for S_ISFIFO - found
-- Looking for S_ISSOCK
-- Looking for S_ISSOCK - found
-- Configuring done
-- Generating done
-- Build files have been written to: /work/math/cantor/work/cantor-20.04.1/_KDE_build/thirdparty/discount_project-build
[ 11%] Performing build step for 'discount_project'
Scanning dependencies of target common
/usr/bin/ld: warning: libstdc++.so.8, needed by /work/math/cantor/work/.buildlink/lib/libKF5JobWidgets.so, may conflict with libstdc++.so.7
/usr/lib/librpcsvc.so.1: warning: warning: this program uses xdr_peername(), which is deprecated and buggy.
/usr/lib/librpcsvc.so.1: warning: warning: this program uses xdr_domainname(), which is deprecated and buggy.
/usr/lib/librpcsvc.so.1: warning: warning: this program uses xdr_mapname(), which is deprecated and buggy.
[  3%] Building C object CMakeFiles/common.dir/work/math/cantor/work/cantor-20.04.1/_KDE_build/thirdparty/src/discount_project/pgm_options.c.o
[ 11%] Built target cantor_config
[ 12%] Building CXX object src/scripteditor/CMakeFiles/cantor_scripteditor.dir/scripteditorwidget.cpp.o
[  6%] Building C object CMakeFiles/common.dir/work/math/cantor/work/cantor-20.04.1/_KDE_build/thirdparty/src/discount_project/gethopt.c.o
/work/math/cantor/work/cantor-20.04.1/_KDE_build/thirdparty/src/discount_project/gethopt.c: In function 'hopterr':
/work/math/cantor/work/cantor-20.04.1/_KDE_build/thirdparty/src/discount_project/gethopt.c:48:1: warning: type of 'val' defaults to 'int' [-Wimplicit-int]
 hopterr(ctx,val)
 ^~~~~~~
[  6%] Built target common
Scanning dependencies of target mktags
[  9%] Building C object CMakeFiles/mktags.dir/work/math/cantor/work/cantor-20.04.1/_KDE_build/thirdparty/src/discount_project/mktags.c.o
[ 12%] Linking C executable mktags
[ 12%] Built target mktags
[ 15%] Generating /work/math/cantor/work/cantor-20.04.1/_KDE_build/thirdparty/src/discount_project/blocktags
Scanning dependencies of target libmarkdown
[ 18%] Building C object CMakeFiles/libmarkdown.dir/work/math/cantor/work/cantor-20.04.1/_KDE_build/thirdparty/src/discount_project/mkdio.c.o
[ 21%] Building C object CMakeFiles/libmarkdown.dir/work/math/cantor/work/cantor-20.04.1/_KDE_build/thirdparty/src/discount_project/markdown.c.o
[ 25%] Building C object CMakeFiles/libmarkdown.dir/work/math/cantor/work/cantor-20.04.1/_KDE_build/thirdparty/src/discount_project/dumptree.c.o
[ 28%] Building C object CMakeFiles/libmarkdown.dir/work/math/cantor/work/cantor-20.04.1/_KDE_build/thirdparty/src/discount_project/generate.c.o
[ 31%] Building C object CMakeFiles/libmarkdown.dir/work/math/cantor/work/cantor-20.04.1/_KDE_build/thirdparty/src/discount_project/resource.c.o
[ 34%] Building C object CMakeFiles/libmarkdown.dir/work/math/cantor/work/cantor-20.04.1/_KDE_build/thirdparty/src/discount_project/docheader.c.o
[ 37%] Building C object CMakeFiles/libmarkdown.dir/work/math/cantor/work/cantor-20.04.1/_KDE_build/thirdparty/src/discount_project/version.c.o
[ 40%] Building C object CMakeFiles/libmarkdown.dir/work/math/cantor/work/cantor-20.04.1/_KDE_build/thirdparty/src/discount_project/toc.c.o
[ 13%] Building CXX object src/lib/CMakeFiles/cantorlibs.dir/session.cpp.o
[ 43%] Building C object CMakeFiles/libmarkdown.dir/work/math/cantor/work/cantor-20.04.1/_KDE_build/thirdparty/src/discount_project/css.c.o
[ 46%] Building C object CMakeFiles/libmarkdown.dir/work/math/cantor/work/cantor-20.04.1/_KDE_build/thirdparty/src/discount_project/xml.c.o
[ 50%] Building C object CMakeFiles/libmarkdown.dir/work/math/cantor/work/cantor-20.04.1/_KDE_build/thirdparty/src/discount_project/Csio.c.o
[ 53%] Building C object CMakeFiles/libmarkdown.dir/work/math/cantor/work/cantor-20.04.1/_KDE_build/thirdparty/src/discount_project/xmlpage.c.o
[ 13%] Building CXX object src/lib/CMakeFiles/cantorlibs.dir/backend.cpp.o
[ 56%] Building C object CMakeFiles/libmarkdown.dir/work/math/cantor/work/cantor-20.04.1/_KDE_build/thirdparty/src/discount_project/basename.c.o
[ 59%] Building C object CMakeFiles/libmarkdown.dir/work/math/cantor/work/cantor-20.04.1/_KDE_build/thirdparty/src/discount_project/emmatch.c.o
[ 62%] Building C object CMakeFiles/libmarkdown.dir/work/math/cantor/work/cantor-20.04.1/_KDE_build/thirdparty/src/discount_project/github_flavoured.c.o
[ 13%] Linking CXX executable cantor_scripteditor
[ 65%] Building C object CMakeFiles/libmarkdown.dir/work/math/cantor/work/cantor-20.04.1/_KDE_build/thirdparty/src/discount_project/setup.c.o
[ 68%] Building C object CMakeFiles/libmarkdown.dir/work/math/cantor/work/cantor-20.04.1/_KDE_build/thirdparty/src/discount_project/tags.c.o
[ 71%] Building C object CMakeFiles/libmarkdown.dir/work/math/cantor/work/cantor-20.04.1/_KDE_build/thirdparty/src/discount_project/html5.c.o
[ 75%] Building C object CMakeFiles/libmarkdown.dir/work/math/cantor/work/cantor-20.04.1/_KDE_build/thirdparty/src/discount_project/flags.c.o
[ 78%] Linking C static library libmarkdown.a
/usr/bin/ld: warning: libstdc++.so.8, needed by /work/math/cantor/work/.buildlink/lib/libKF5JobWidgets.so, may conflict with libstdc++.so.7
/usr/lib/librpcsvc.so.1: warning: warning: this program uses xdr_peername(), which is deprecated and buggy.
/usr/lib/librpcsvc.so.1: warning: warning: this program uses xdr_domainname(), which is deprecated and buggy.
/usr/lib/librpcsvc.so.1: warning: warning: this program uses xdr_mapname(), which is deprecated and buggy.
[ 13%] Built target cantor_scripteditor
[ 14%] Building CXX object src/lib/CMakeFiles/cantorlibs.dir/result.cpp.o
[ 78%] Built target libmarkdown
Scanning dependencies of target markdown
[ 81%] Building C object CMakeFiles/markdown.dir/work/math/cantor/work/cantor-20.04.1/_KDE_build/thirdparty/src/discount_project/main.c.o
/work/math/cantor/work/cantor-20.04.1/_KDE_build/thirdparty/src/discount_project/main.c: In function 'main':
/work/math/cantor/work/cantor-20.04.1/_KDE_build/thirdparty/src/discount_project/main.c:311:29: warning: passing argument 2 of 'mkd_e_code_format' from incompatible pointer type [-Wincompatible-pointer-types]
      mkd_e_code_format(doc, external_codefmt);
                             ^~~~~~~~~~~~~~~~
In file included from /work/math/cantor/work/cantor-20.04.1/_KDE_build/thirdparty/src/discount_project/main.c:12:0:
/work/math/cantor/work/cantor-20.04.1/_KDE_build/thirdparty/src/discount_project/mkdio.h:72:6: note: expected 'mkd_callback_t {aka char * (*)(const char *, const int,  void *)}' but argument is of type 'char * (*)(char *, int,  char *)'
 void mkd_e_code_format(void*, mkd_callback_t);
      ^~~~~~~~~~~~~~~~~
[ 84%] Linking C executable markdown
[ 84%] Built target markdown
Scanning dependencies of target makepage
[ 87%] Building C object CMakeFiles/makepage.dir/work/math/cantor/work/cantor-20.04.1/_KDE_build/thirdparty/src/discount_project/makepage.c.o
[ 90%] Linking C executable makepage
[ 90%] Built target makepage
Scanning dependencies of target mkd2html
[ 93%] Building C object CMakeFiles/mkd2html.dir/work/math/cantor/work/cantor-20.04.1/_KDE_build/thirdparty/src/discount_project/mkd2html.c.o
/work/math/cantor/work/cantor-20.04.1/_KDE_build/thirdparty/src/discount_project/mkd2html.c: In function 'main':
/work/math/cantor/work/cantor-20.04.1/_KDE_build/thirdparty/src/discount_project/mkd2html.c:88:1: warning: type of 'argc' defaults to 'int' [-Wimplicit-int]
 main(argc, argv)
 ^~~~
[ 96%] Building C object CMakeFiles/mkd2html.dir/work/math/cantor/work/cantor-20.04.1/_KDE_build/thirdparty/src/discount_project/notspecial.c.o
[100%] Linking C executable mkd2html
[100%] Built target mkd2html
[ 15%] No install step for 'discount_project'
[ 15%] Completed 'discount_project'
[ 15%] Building CXX object src/lib/CMakeFiles/cantorlibs.dir/textresult.cpp.o
[ 15%] Built target discount_project
[ 15%] Building CXX object src/lib/CMakeFiles/cantorlibs.dir/imageresult.cpp.o
[ 15%] Building CXX object src/lib/CMakeFiles/cantorlibs.dir/mimeresult.cpp.o
[ 16%] Building CXX object src/lib/CMakeFiles/cantorlibs.dir/epsresult.cpp.o
[ 16%] Building CXX object src/lib/CMakeFiles/cantorlibs.dir/latexresult.cpp.o
[ 17%] Building CXX object src/lib/CMakeFiles/cantorlibs.dir/renderer.cpp.o
[ 17%] Building CXX object src/lib/CMakeFiles/cantorlibs.dir/helpresult.cpp.o
[ 17%] Building CXX object src/lib/CMakeFiles/cantorlibs.dir/animationresult.cpp.o
[ 17%] Building CXX object src/lib/CMakeFiles/cantorlibs.dir/htmlresult.cpp.o
[ 18%] Building CXX object src/lib/CMakeFiles/cantorlibs.dir/extension.cpp.o
[ 18%] Building CXX object src/lib/CMakeFiles/cantorlibs.dir/assistant.cpp.o
[ 18%] Building CXX object src/lib/CMakeFiles/cantorlibs.dir/completionobject.cpp.o
[ 19%] Building CXX object src/lib/CMakeFiles/cantorlibs.dir/syntaxhelpobject.cpp.o
[ 19%] Building CXX object src/lib/CMakeFiles/cantorlibs.dir/defaulthighlighter.cpp.o
[ 19%] Building CXX object src/lib/CMakeFiles/cantorlibs.dir/defaultvariablemodel.cpp.o
[ 19%] Building CXX object src/lib/CMakeFiles/cantorlibs.dir/panelplugin.cpp.o
[ 20%] Building CXX object src/lib/CMakeFiles/cantorlibs.dir/panelpluginhandler.cpp.o
/work/math/cantor/work/cantor-20.04.1/src/lib/defaulthighlighter.cpp: In member function 'void Cantor::DefaultHighlighter::highlightWords(const QString&)':
/work/math/cantor/work/cantor-20.04.1/src/lib/defaulthighlighter.cpp:219:109: warning: 'QStringList QString::split(const QRegularExpression&, QString::SplitBehavior) const' is deprecated: Use Qt::SplitBehavior variant instead [-Wdeprecated-declarations]
     const QStringList& words = text.split(QRegularExpression(QStringLiteral("\\b")), QString::SkipEmptyParts);
                                                                                                             ^
In file included from /usr/pkg/qt5/include/QtCore/qregularexpression.h:45:0,
                 from /usr/pkg/qt5/include/QtCore/QRegularExpression:1,
                 from /work/math/cantor/work/cantor-20.04.1/src/lib/defaulthighlighter.h:26,
                 from /work/math/cantor/work/cantor-20.04.1/src/lib/defaulthighlighter.cpp:22:
/usr/pkg/qt5/include/QtCore/qstring.h:628:17: note: declared here
     QStringList split(const QRegularExpression &sep, SplitBehavior behavior) const;
                 ^~~~~
[ 20%] Building CXX object src/lib/CMakeFiles/cantorlibs.dir/worksheetaccess.cpp.o
[ 21%] Building CXX object src/lib/CMakeFiles/cantorlibs.dir/jupyterutils.cpp.o
[ 21%] Building CXX object src/lib/CMakeFiles/cantorlibs.dir/expression.cpp.o
[ 21%] Building CXX object src/lib/CMakeFiles/cantorlibs.dir/latexrenderer.cpp.o
[ 21%] Building CXX object src/lib/CMakeFiles/cantorlibs.dir/directives/plotdirectives.cpp.o
/work/math/cantor/work/cantor-20.04.1/src/lib/jupyterutils.cpp: In static member function 'static bool Cantor::JupyterUtils::isJupyterNotebook(const QJsonDocument&)':
/work/math/cantor/work/cantor-20.04.1/src/lib/jupyterutils.cpp:100:26: warning: 'static QSet<T> QSet<T>::fromList(const QList<T>&) [with T = QString]' is deprecated: Use QSet<T>(list.begin(), list.end()) instead. [-Wdeprecated-declarations]
         = QSet<QString>::fromList({cellsKey, metadataKey, nbformatKey, nbformatMinorKey});
                          ^~~~~~~~
In file included from /usr/pkg/qt5/include/QtCore/qdebug.h:52:0,
                 from /usr/pkg/qt5/include/QtCore/qcborcommon.h:45,
                 from /usr/pkg/qt5/include/QtCore/qcborvalue.h:45,
                 from /usr/pkg/qt5/include/QtCore/qjsonvalue.h:46,
                 from /usr/pkg/qt5/include/QtCore/qjsonobject.h:43,
                 from /usr/pkg/qt5/include/QtCore/qplugin.h:46,
                 from /usr/pkg/qt5/include/QtCore/qpluginloader.h:47,
                 from /usr/pkg/qt5/include/QtCore/QPluginLoader:1,
                 from /usr/pkg/include/KF5/KCoreAddons/kexportplugin.h:12,
                 from /usr/pkg/include/KF5/KCoreAddons/kpluginfactory.h:18,
                 from /usr/pkg/include/KF5/KService/kservice.h:27,
                 from /usr/pkg/include/KF5/KService/kplugininfo.h:28,
                 from /usr/pkg/include/KF5/KService/KPluginInfo:1,
                 from /work/math/cantor/work/cantor-20.04.1/src/lib/backend.h:27,
                 from /work/math/cantor/work/cantor-20.04.1/src/lib/jupyterutils.cpp:22:
/usr/pkg/qt5/include/QtCore/qset.h:416:9: note: declared here
 QSet<T> QSet<T>::fromList(const QList<T> &list)
         ^~~~~~~
/work/math/cantor/work/cantor-20.04.1/src/lib/jupyterutils.cpp:100:89: warning: 'static QSet<T> QSet<T>::fromList(const QList<T>&) [with T = QString]' is deprecated: Use QSet<T>(list.begin(), list.end()) instead. [-Wdeprecated-declarations]
         = QSet<QString>::fromList({cellsKey, metadataKey, nbformatKey, nbformatMinorKey});
                                                                                         ^
In file included from /usr/pkg/qt5/include/QtCore/qdebug.h:52:0,
                 from /usr/pkg/qt5/include/QtCore/qcborcommon.h:45,
                 from /usr/pkg/qt5/include/QtCore/qcborvalue.h:45,
                 from /usr/pkg/qt5/include/QtCore/qjsonvalue.h:46,
                 from /usr/pkg/qt5/include/QtCore/qjsonobject.h:43,
                 from /usr/pkg/qt5/include/QtCore/qplugin.h:46,
                 from /usr/pkg/qt5/include/QtCore/qpluginloader.h:47,
                 from /usr/pkg/qt5/include/QtCore/QPluginLoader:1,
                 from /usr/pkg/include/KF5/KCoreAddons/kexportplugin.h:12,
                 from /usr/pkg/include/KF5/KCoreAddons/kpluginfactory.h:18,
                 from /usr/pkg/include/KF5/KService/kservice.h:27,
                 from /usr/pkg/include/KF5/KService/kplugininfo.h:28,
                 from /usr/pkg/include/KF5/KService/KPluginInfo:1,
                 from /work/math/cantor/work/cantor-20.04.1/src/lib/backend.h:27,
                 from /work/math/cantor/work/cantor-20.04.1/src/lib/jupyterutils.cpp:22:
/usr/pkg/qt5/include/QtCore/qset.h:416:9: note: declared here
 QSet<T> QSet<T>::fromList(const QList<T> &list)
         ^~~~~~~
/work/math/cantor/work/cantor-20.04.1/src/lib/jupyterutils.cpp:104:27: warning: 'static QSet<T> QSet<T>::fromList(const QList<T>&) [with T = QString]' is deprecated: Use QSet<T>(list.begin(), list.end()) instead. [-Wdeprecated-declarations]
         && QSet<QString>::fromList(doc.object().keys()) == notebookScheme
                           ^~~~~~~~
In file included from /usr/pkg/qt5/include/QtCore/qdebug.h:52:0,
                 from /usr/pkg/qt5/include/QtCore/qcborcommon.h:45,
                 from /usr/pkg/qt5/include/QtCore/qcborvalue.h:45,
                 from /usr/pkg/qt5/include/QtCore/qjsonvalue.h:46,
                 from /usr/pkg/qt5/include/QtCore/qjsonobject.h:43,
                 from /usr/pkg/qt5/include/QtCore/qplugin.h:46,
                 from /usr/pkg/qt5/include/QtCore/qpluginloader.h:47,
                 from /usr/pkg/qt5/include/QtCore/QPluginLoader:1,
                 from /usr/pkg/include/KF5/KCoreAddons/kexportplugin.h:12,
                 from /usr/pkg/include/KF5/KCoreAddons/kpluginfactory.h:18,
                 from /usr/pkg/include/KF5/KService/kservice.h:27,
                 from /usr/pkg/include/KF5/KService/kplugininfo.h:28,
                 from /usr/pkg/include/KF5/KService/KPluginInfo:1,
                 from /work/math/cantor/work/cantor-20.04.1/src/lib/backend.h:27,
                 from /work/math/cantor/work/cantor-20.04.1/src/lib/jupyterutils.cpp:22:
/usr/pkg/qt5/include/QtCore/qset.h:416:9: note: declared here
 QSet<T> QSet<T>::fromList(const QList<T> &list)
         ^~~~~~~
/work/math/cantor/work/cantor-20.04.1/src/lib/jupyterutils.cpp:104:55: warning: 'static QSet<T> QSet<T>::fromList(const QList<T>&) [with T = QString]' is deprecated: Use QSet<T>(list.begin(), list.end()) instead. [-Wdeprecated-declarations]
         && QSet<QString>::fromList(doc.object().keys()) == notebookScheme
                                                       ^
In file included from /usr/pkg/qt5/include/QtCore/qdebug.h:52:0,
                 from /usr/pkg/qt5/include/QtCore/qcborcommon.h:45,
                 from /usr/pkg/qt5/include/QtCore/qcborvalue.h:45,
                 from /usr/pkg/qt5/include/QtCore/qjsonvalue.h:46,
                 from /usr/pkg/qt5/include/QtCore/qjsonobject.h:43,
                 from /usr/pkg/qt5/include/QtCore/qplugin.h:46,
                 from /usr/pkg/qt5/include/QtCore/qpluginloader.h:47,
                 from /usr/pkg/qt5/include/QtCore/QPluginLoader:1,
                 from /usr/pkg/include/KF5/KCoreAddons/kexportplugin.h:12,
                 from /usr/pkg/include/KF5/KCoreAddons/kpluginfactory.h:18,
                 from /usr/pkg/include/KF5/KService/kservice.h:27,
                 from /usr/pkg/include/KF5/KService/kplugininfo.h:28,
                 from /usr/pkg/include/KF5/KService/KPluginInfo:1,
                 from /work/math/cantor/work/cantor-20.04.1/src/lib/backend.h:27,
                 from /work/math/cantor/work/cantor-20.04.1/src/lib/jupyterutils.cpp:22:
/usr/pkg/qt5/include/QtCore/qset.h:416:9: note: declared here
 QSet<T> QSet<T>::fromList(const QList<T> &list)
         ^~~~~~~
[ 21%] Building CXX object src/lib/CMakeFiles/cantorlibs.dir/settings.cpp.o
In file included from /work/math/cantor/work/cantor-20.04.1/src/lib/directives/plotdirectives.h:24:0,
                 from /work/math/cantor/work/cantor-20.04.1/src/lib/directives/plotdirectives.cpp:21:
/work/math/cantor/work/cantor-20.04.1/src/lib/extension.h:231:47: warning: 'virtual QString Cantor::PlotTitleDirective::dispatch(const Cantor::AdvancedPlotExtension::AcceptorBase&) const' can be marked override [-Wsuggest-override]
 #define PLOT_DIRECTIVE_DISPATCHING(x) QString dispatch(const Cantor::AdvancedPlotExtension::AcceptorBase& acc) const \
                                               ^
/work/math/cantor/work/cantor-20.04.1/src/lib/directives/plotdirectives.h:33:13: note: in expansion of macro 'PLOT_DIRECTIVE_DISPATCHING'
             PLOT_DIRECTIVE_DISPATCHING(PlotTitleDirective);
             ^~~~~~~~~~~~~~~~~~~~~~~~~~
/work/math/cantor/work/cantor-20.04.1/src/lib/extension.h:231:47: warning: 'virtual QString Cantor::AbstractScaleDirective::dispatch(const Cantor::AdvancedPlotExtension::AcceptorBase&) const' can be marked override [-Wsuggest-override]
 #define PLOT_DIRECTIVE_DISPATCHING(x) QString dispatch(const Cantor::AdvancedPlotExtension::AcceptorBase& acc) const \
                                               ^
/work/math/cantor/work/cantor-20.04.1/src/lib/directives/plotdirectives.h:46:13: note: in expansion of macro 'PLOT_DIRECTIVE_DISPATCHING'
             PLOT_DIRECTIVE_DISPATCHING(AbstractScaleDirective);
             ^~~~~~~~~~~~~~~~~~~~~~~~~~
/work/math/cantor/work/cantor-20.04.1/src/lib/extension.h:231:47: warning: 'virtual QString Cantor::OrdinateScaleDirective::dispatch(const Cantor::AdvancedPlotExtension::AcceptorBase&) const' can be marked override [-Wsuggest-override]
 #define PLOT_DIRECTIVE_DISPATCHING(x) QString dispatch(const Cantor::AdvancedPlotExtension::AcceptorBase& acc) const \
                                               ^
/work/math/cantor/work/cantor-20.04.1/src/lib/directives/plotdirectives.h:61:13: note: in expansion of macro 'PLOT_DIRECTIVE_DISPATCHING'
             PLOT_DIRECTIVE_DISPATCHING(OrdinateScaleDirective);
             ^~~~~~~~~~~~~~~~~~~~~~~~~~
/work/math/cantor/work/cantor-20.04.1/src/lib/extension.h:231:47: warning: 'virtual QString Cantor::AbscissScaleDirective::dispatch(const Cantor::AdvancedPlotExtension::AcceptorBase&) const' can be marked override [-Wsuggest-override]
 #define PLOT_DIRECTIVE_DISPATCHING(x) QString dispatch(const Cantor::AdvancedPlotExtension::AcceptorBase& acc) const \
                                               ^
/work/math/cantor/work/cantor-20.04.1/src/lib/directives/plotdirectives.h:69:13: note: in expansion of macro 'PLOT_DIRECTIVE_DISPATCHING'
             PLOT_DIRECTIVE_DISPATCHING(AbscissScaleDirective);
             ^~~~~~~~~~~~~~~~~~~~~~~~~~
[ 21%] Linking CXX shared library libcantorlibs.so
/usr/bin/ld: warning: libstdc++.so.8, needed by /work/math/cantor/work/.buildlink/lib/libpoppler-qt5.so, may conflict with libstdc++.so.7
/usr/lib/librpcsvc.so.1: warning: warning: this program uses xdr_peername(), which is deprecated and buggy.
/usr/lib/librpcsvc.so.1: warning: warning: this program uses xdr_domainname(), which is deprecated and buggy.
/usr/lib/librpcsvc.so.1: warning: warning: this program uses xdr_mapname(), which is deprecated and buggy.
[ 21%] Built target cantorlibs
Scanning dependencies of target cantorpart_autogen
Scanning dependencies of target cantortest_autogen
Scanning dependencies of target cantor_maximabackend_autogen
Scanning dependencies of target cantor_autogen
[ 21%] Automatic MOC for target cantortest
[ 21%] Automatic MOC for target cantorpart
[ 21%] Automatic MOC for target cantor_maximabackend
[ 22%] Automatic MOC for target cantor
[ 22%] Built target cantor_autogen
Scanning dependencies of target cantor_octavebackend_autogen
[ 22%] Automatic MOC for target cantor_octavebackend
[ 22%] Built target cantortest_autogen
Scanning dependencies of target cantor_scilabbackend_autogen
[ 23%] Automatic MOC for target cantor_scilabbackend
[ 23%] Built target cantor_maximabackend_autogen
Scanning dependencies of target cantor_sagebackend_autogen
[ 23%] Automatic MOC for target cantor_sagebackend
[ 23%] Built target cantor_octavebackend_autogen
Scanning dependencies of target cantor_kalgebrabackend_autogen
[ 23%] Automatic MOC for target cantor_kalgebrabackend
[ 23%] Built target cantor_scilabbackend_autogen
[ 24%] Generating settings.h, settings.cpp
[ 24%] Generating ui_settings.h
Scanning dependencies of target cantor_qalculatebackend
[ 24%] Building CXX object src/backends/qalculate/CMakeFiles/cantor_qalculatebackend.dir/cantor_qalculatebackend_autogen/mocs_compilation.cpp.o
[ 24%] Built target cantor_kalgebrabackend_autogen
[ 24%] Building CXX object src/backends/qalculate/CMakeFiles/cantor_qalculatebackend.dir/qalculatehighlighter.cpp.o
[ 24%] Built target cantor_sagebackend_autogen
[ 24%] Building CXX object src/backends/qalculate/CMakeFiles/cantor_qalculatebackend.dir/qalculateextensions.cpp.o
[ 24%] Built target cantorpart_autogen
Scanning dependencies of target cantor_qalculateplotassistant_autogen
[ 24%] Automatic MOC for target cantor_qalculateplotassistant
[ 24%] Built target cantor_qalculateplotassistant_autogen
[ 24%] Generating qrc_python.cpp
[ 24%] Generating settings.h, settings.cpp
[ 25%] Generating ui_settings.h
Scanning dependencies of target cantor_pythonbackend
[ 25%] Building CXX object src/backends/python/CMakeFiles/cantor_pythonbackend.dir/cantor_pythonbackend_autogen/mocs_compilation.cpp.o
/work/math/cantor/work/cantor-20.04.1/src/backends/qalculate/qalculatehighlighter.cpp: In member function 'virtual void QalculateHighlighter::highlightBlock(const QString&)':
/work/math/cantor/work/cantor-20.04.1/src/backends/qalculate/qalculatehighlighter.cpp:50:108: warning: 'QStringList QString::split(const QRegularExpression&, QString::SplitBehavior) const' is deprecated: Use Qt::SplitBehavior variant instead [-Wdeprecated-declarations]
     const QStringList words = text.split(QRegularExpression(QStringLiteral("\\b")), QString::SkipEmptyParts);
                                                                                                            ^
In file included from /usr/pkg/qt5/include/QtCore/qregularexpression.h:45:0,
                 from /usr/pkg/qt5/include/QtCore/QRegularExpression:1,
                 from /work/math/cantor/work/cantor-20.04.1/src/lib/defaulthighlighter.h:26,
                 from /work/math/cantor/work/cantor-20.04.1/src/backends/qalculate/qalculatehighlighter.h:22,
                 from /work/math/cantor/work/cantor-20.04.1/src/backends/qalculate/qalculatehighlighter.cpp:19:
/usr/pkg/qt5/include/QtCore/qstring.h:628:17: note: declared here
     QStringList split(const QRegularExpression &sep, SplitBehavior behavior) const;
                 ^~~~~
Scanning dependencies of target cantor_solveassistant_autogen
[ 26%] Automatic MOC for target cantor_solveassistant
[ 26%] Building CXX object src/backends/qalculate/CMakeFiles/cantor_qalculatebackend.dir/qalculatecompletionobject.cpp.o
[ 27%] Building CXX object src/backends/python/CMakeFiles/cantor_pythonbackend.dir/pythonkeywords.cpp.o
[ 27%] Built target cantor_solveassistant_autogen
Scanning dependencies of target cantor_integrateassistant_autogen
[ 27%] Automatic MOC for target cantor_integrateassistant
[ 27%] Built target cantor_integrateassistant_autogen
Scanning dependencies of target cantor_differentiateassistant_autogen
[ 27%] Automatic MOC for target cantor_differentiateassistant
[ 27%] Building CXX object src/backends/python/CMakeFiles/cantor_pythonbackend.dir/pythonhighlighter.cpp.o
[ 27%] Built target cantor_differentiateassistant_autogen
Scanning dependencies of target cantor_creatematrixassistant_autogen
[ 28%] Automatic MOC for target cantor_creatematrixassistant
[ 29%] Building CXX object src/backends/qalculate/CMakeFiles/cantor_qalculatebackend.dir/qalculateexpression.cpp.o
[ 29%] Built target cantor_creatematrixassistant_autogen
[ 29%] Building CXX object src/backends/python/CMakeFiles/cantor_pythonbackend.dir/pythoncompletionobject.cpp.o
[ 30%] Building CXX object src/backends/python/CMakeFiles/cantor_pythonbackend.dir/pythonextensions.cpp.o
[ 30%] Building CXX object src/backends/python/CMakeFiles/cantor_pythonbackend.dir/pythonexpression.cpp.o
[ 30%] Building CXX object src/backends/qalculate/CMakeFiles/cantor_qalculatebackend.dir/qalculatesession.cpp.o
/work/math/cantor/work/cantor-20.04.1/src/backends/qalculate/qalculateexpression.cpp: In member function 'void QalculateExpression::parseOutput(QString&)':
/work/math/cantor/work/cantor-20.04.1/src/backends/qalculate/qalculateexpression.cpp:108:83: warning: 'QTextStream& QTextStreamFunctions::endl(QTextStream&)' is deprecated: Use Qt::endl [-Wdeprecated-declarations]
     qDebug() << "output from qalc for command: " << command() << " " << output << endl;
                                                                                   ^~~~
In file included from /usr/pkg/qt5/include/QtCore/qdebug.h:49:0,
                 from /usr/pkg/qt5/include/QtCore/qcborcommon.h:45,
                 from /usr/pkg/qt5/include/QtCore/qcborvalue.h:45,
                 from /usr/pkg/qt5/include/QtCore/qjsonvalue.h:46,
                 from /usr/pkg/qt5/include/QtCore/qjsonarray.h:43,
                 from /usr/pkg/qt5/include/QtCore/QJsonArray:1,
                 from /work/math/cantor/work/cantor-20.04.1/src/lib/result.h:26,
                 from /work/math/cantor/work/cantor-20.04.1/src/lib/textresult.h:24,
                 from /work/math/cantor/work/cantor-20.04.1/src/backends/qalculate/qalculateexpression.cpp:22:
/usr/pkg/qt5/include/QtCore/qtextstream.h:293:75: note: declared here
 Q_CORE_EXPORT QT_DEPRECATED_VERSION_X(5, 15, "Use Qt::endl") QTextStream &endl(QTextStream &s);
                                                                           ^~~~
/work/math/cantor/work/cantor-20.04.1/src/backends/qalculate/qalculateexpression.cpp: In member function 'void QalculateExpression::parseError(QString&)':
/work/math/cantor/work/cantor-20.04.1/src/backends/qalculate/qalculateexpression.cpp:131:82: warning: 'QTextStream& QTextStreamFunctions::endl(QTextStream&)' is deprecated: Use Qt::endl [-Wdeprecated-declarations]
     qDebug() << "Error from qalc for command: " << command() <<  " " << error << endl;
                                                                                  ^~~~
In file included from /usr/pkg/qt5/include/QtCore/qdebug.h:49:0,
                 from /usr/pkg/qt5/include/QtCore/qcborcommon.h:45,
                 from /usr/pkg/qt5/include/QtCore/qcborvalue.h:45,
                 from /usr/pkg/qt5/include/QtCore/qjsonvalue.h:46,
                 from /usr/pkg/qt5/include/QtCore/qjsonarray.h:43,
                 from /usr/pkg/qt5/include/QtCore/QJsonArray:1,
                 from /work/math/cantor/work/cantor-20.04.1/src/lib/result.h:26,
                 from /work/math/cantor/work/cantor-20.04.1/src/lib/textresult.h:24,
                 from /work/math/cantor/work/cantor-20.04.1/src/backends/qalculate/qalculateexpression.cpp:22:
/usr/pkg/qt5/include/QtCore/qtextstream.h:293:75: note: declared here
 Q_CORE_EXPORT QT_DEPRECATED_VERSION_X(5, 15, "Use Qt::endl") QTextStream &endl(QTextStream &s);
                                                                           ^~~~
[ 30%] Building CXX object src/backends/python/CMakeFiles/cantor_pythonbackend.dir/pythonsession.cpp.o
[ 30%] Building CXX object src/backends/python/CMakeFiles/cantor_pythonbackend.dir/pythonvariablemodel.cpp.o
[ 31%] Building CXX object src/backends/python/CMakeFiles/cantor_pythonbackend.dir/pythonbackend.cpp.o
/work/math/cantor/work/cantor-20.04.1/src/backends/qalculate/qalculatesession.cpp: In member function 'void QalculateSession::readOutput()':
/work/math/cantor/work/cantor-20.04.1/src/backends/qalculate/qalculatesession.cpp:109:41: warning: 'QTextStream& QTextStreamFunctions::endl(QTextStream&)' is deprecated: Use Qt::endl [-Wdeprecated-declarations]
                 qDebug() << m_output << endl;
                                         ^~~~
In file included from /usr/pkg/qt5/include/QtCore/qdebug.h:49:0,
                 from /usr/pkg/qt5/include/QtCore/QDebug:1,
                 from /work/math/cantor/work/cantor-20.04.1/_KDE_build/src/backends/qalculate/settings.h:8,
                 from /work/math/cantor/work/cantor-20.04.1/src/backends/qalculate/qalculatesession.cpp:20:
/usr/pkg/qt5/include/QtCore/qtextstream.h:293:75: note: declared here
 Q_CORE_EXPORT QT_DEPRECATED_VERSION_X(5, 15, "Use Qt::endl") QTextStream &endl(QTextStream &s);
                                                                           ^~~~
/work/math/cantor/work/cantor-20.04.1/src/backends/qalculate/qalculatesession.cpp:145:73: warning: 'QTextStream& QTextStreamFunctions::endl(QTextStream&)' is deprecated: Use Qt::endl [-Wdeprecated-declarations]
                     qDebug () << "parsing output: " << m_finalOutput << endl;
                                                                         ^~~~
In file included from /usr/pkg/qt5/include/QtCore/qdebug.h:49:0,
                 from /usr/pkg/qt5/include/QtCore/QDebug:1,
                 from /work/math/cantor/work/cantor-20.04.1/_KDE_build/src/backends/qalculate/settings.h:8,
                 from /work/math/cantor/work/cantor-20.04.1/src/backends/qalculate/qalculatesession.cpp:20:
/usr/pkg/qt5/include/QtCore/qtextstream.h:293:75: note: declared here
 Q_CORE_EXPORT QT_DEPRECATED_VERSION_X(5, 15, "Use Qt::endl") QTextStream &endl(QTextStream &s);
                                                                           ^~~~
/work/math/cantor/work/cantor-20.04.1/src/backends/qalculate/qalculatesession.cpp: In member function 'void QalculateSession::storeVariables(QString&, QString)':
/work/math/cantor/work/cantor-20.04.1/src/backends/qalculate/qalculatesession.cpp:158:50: warning: 'QTextStream& QTextStreamFunctions::endl(QTextStream&)' is deprecated: Use Qt::endl [-Wdeprecated-declarations]
     qDebug() << "save command " << currentCmd << endl;
                                                  ^~~~
In file included from /usr/pkg/qt5/include/QtCore/qdebug.h:49:0,
                 from /usr/pkg/qt5/include/QtCore/QDebug:1,
                 from /work/math/cantor/work/cantor-20.04.1/_KDE_build/src/backends/qalculate/settings.h:8,
                 from /work/math/cantor/work/cantor-20.04.1/src/backends/qalculate/qalculatesession.cpp:20:
/usr/pkg/qt5/include/QtCore/qtextstream.h:293:75: note: declared here
 Q_CORE_EXPORT QT_DEPRECATED_VERSION_X(5, 15, "Use Qt::endl") QTextStream &endl(QTextStream &s);
                                                                           ^~~~
/work/math/cantor/work/cantor-20.04.1/src/backends/qalculate/qalculatesession.cpp: In member function 'void QalculateSession::processStarted()':
/work/math/cantor/work/cantor-20.04.1/src/backends/qalculate/qalculatesession.cpp:211:90: warning: 'QTextStream& QTextStreamFunctions::endl(QTextStream&)' is deprecated: Use Qt::endl [-Wdeprecated-declarations]
     qDebug() << "process  started " << m_process->program() << m_process->processId() << endl;
                                                                                          ^~~~
In file included from /usr/pkg/qt5/include/QtCore/qdebug.h:49:0,
                 from /usr/pkg/qt5/include/QtCore/QDebug:1,
                 from /work/math/cantor/work/cantor-20.04.1/_KDE_build/src/backends/qalculate/settings.h:8,
                 from /work/math/cantor/work/cantor-20.04.1/src/backends/qalculate/qalculatesession.cpp:20:
/usr/pkg/qt5/include/QtCore/qtextstream.h:293:75: note: declared here
 Q_CORE_EXPORT QT_DEPRECATED_VERSION_X(5, 15, "Use Qt::endl") QTextStream &endl(QTextStream &s);
                                                                           ^~~~
/work/math/cantor/work/cantor-20.04.1/src/backends/qalculate/qalculatesession.cpp: In member function 'virtual void QalculateSession::logout()':
/work/math/cantor/work/cantor-20.04.1/src/backends/qalculate/qalculatesession.cpp:216:36: warning: 'QTextStream& QTextStreamFunctions::endl(QTextStream&)' is deprecated: Use Qt::endl [-Wdeprecated-declarations]
     qDebug () << "logging out " << endl;
                                    ^~~~
In file included from /usr/pkg/qt5/include/QtCore/qdebug.h:49:0,
                 from /usr/pkg/qt5/include/QtCore/QDebug:1,
                 from /work/math/cantor/work/cantor-20.04.1/_KDE_build/src/backends/qalculate/settings.h:8,
                 from /work/math/cantor/work/cantor-20.04.1/src/backends/qalculate/qalculatesession.cpp:20:
/usr/pkg/qt5/include/QtCore/qtextstream.h:293:75: note: declared here
 Q_CORE_EXPORT QT_DEPRECATED_VERSION_X(5, 15, "Use Qt::endl") QTextStream &endl(QTextStream &s);
                                                                           ^~~~
/work/math/cantor/work/cantor-20.04.1/src/backends/qalculate/qalculatesession.cpp: In member function 'virtual void QalculateSession::interrupt()':
/work/math/cantor/work/cantor-20.04.1/src/backends/qalculate/qalculatesession.cpp:234:42: warning: 'QTextStream& QTextStreamFunctions::endl(QTextStream&)' is deprecated: Use Qt::endl [-Wdeprecated-declarations]
     qDebug () << "interrupting .... " << endl;
                                          ^~~~
In file included from /usr/pkg/qt5/include/QtCore/qdebug.h:49:0,
                 from /usr/pkg/qt5/include/QtCore/QDebug:1,
                 from /work/math/cantor/work/cantor-20.04.1/_KDE_build/src/backends/qalculate/settings.h:8,
                 from /work/math/cantor/work/cantor-20.04.1/src/backends/qalculate/qalculatesession.cpp:20:
/usr/pkg/qt5/include/QtCore/qtextstream.h:293:75: note: declared here
 Q_CORE_EXPORT QT_DEPRECATED_VERSION_X(5, 15, "Use Qt::endl") QTextStream &endl(QTextStream &s);
                                                                           ^~~~
/work/math/cantor/work/cantor-20.04.1/src/backends/qalculate/qalculatesession.cpp: In member function 'virtual Cantor::Expression* QalculateSession::evaluateExpression(const QString&, Cantor::Expression::FinishingBehavior, bool)':
/work/math/cantor/work/cantor-20.04.1/src/backends/qalculate/qalculatesession.cpp:367:57: warning: 'QTextStream& QTextStreamFunctions::endl(QTextStream&)' is deprecated: Use Qt::endl [-Wdeprecated-declarations]
     qDebug() << " ** evaluating expression: " << cmd << endl;
                                                         ^~~~
In file included from /usr/pkg/qt5/include/QtCore/qdebug.h:49:0,
                 from /usr/pkg/qt5/include/QtCore/QDebug:1,
                 from /work/math/cantor/work/cantor-20.04.1/_KDE_build/src/backends/qalculate/settings.h:8,
                 from /work/math/cantor/work/cantor-20.04.1/src/backends/qalculate/qalculatesession.cpp:20:
/usr/pkg/qt5/include/QtCore/qtextstream.h:293:75: note: declared here
 Q_CORE_EXPORT QT_DEPRECATED_VERSION_X(5, 15, "Use Qt::endl") QTextStream &endl(QTextStream &s);
                                                                           ^~~~
/work/math/cantor/work/cantor-20.04.1/src/backends/qalculate/qalculatesession.cpp:368:78: warning: 'QTextStream& QTextStreamFunctions::endl(QTextStream&)' is deprecated: Use Qt::endl [-Wdeprecated-declarations]
     qDebug() << " size of expression queue: " << m_expressionQueue.size() << endl;
                                                                              ^~~~
In file included from /usr/pkg/qt5/include/QtCore/qdebug.h:49:0,
                 from /usr/pkg/qt5/include/QtCore/QDebug:1,
                 from /work/math/cantor/work/cantor-20.04.1/_KDE_build/src/backends/qalculate/settings.h:8,
                 from /work/math/cantor/work/cantor-20.04.1/src/backends/qalculate/qalculatesession.cpp:20:
/usr/pkg/qt5/include/QtCore/qtextstream.h:293:75: note: declared here
 Q_CORE_EXPORT QT_DEPRECATED_VERSION_X(5, 15, "Use Qt::endl") QTextStream &endl(QTextStream &s);
                                                                           ^~~~
/work/math/cantor/work/cantor-20.04.1/src/backends/python/pythonsession.cpp: In member function 'virtual void PythonSession::login()':
/work/math/cantor/work/cantor-20.04.1/src/backends/python/pythonsession.cpp:83:70: warning: 'void QProcess::start(const QString&, QIODevice::OpenMode)' is deprecated: Use QProcess::start(const QString &program, const QStringList &arguments,OpenMode mode = ReadWrite) instead [-Wdeprecated-declarations]
     m_process->start(PythonSettings::pythonServerPath().toLocalFile());
                                                                      ^
In file included from /usr/pkg/qt5/include/QtCore/QProcess:1:0,
                 from /work/math/cantor/work/cantor-20.04.1/src/backends/python/pythonsession.h:28,
                 from /work/math/cantor/work/cantor-20.04.1/src/backends/python/pythonsession.cpp:23:
/usr/pkg/qt5/include/QtCore/qprocess.h:168:10: note: declared here
     void start(const QString &command, OpenMode mode = ReadWrite);
          ^~~~~
/work/math/cantor/work/cantor-20.04.1/src/backends/python/pythonsession.cpp: In member function 'virtual void PythonSession::interrupt()':
/work/math/cantor/work/cantor-20.04.1/src/backends/python/pythonsession.cpp:146:42: warning: 'Q_PID QProcess::pid() const' is deprecated: Use processId() instead [-Wdeprecated-declarations]
             const int pid=m_process->pid();
                                          ^
In file included from /usr/pkg/qt5/include/QtCore/QProcess:1:0,
                 from /work/math/cantor/work/cantor-20.04.1/src/backends/python/pythonsession.h:28,
                 from /work/math/cantor/work/cantor-20.04.1/src/backends/python/pythonsession.cpp:23:
/usr/pkg/qt5/include/QtCore/qprocess.h:237:11: note: declared here
     Q_PID pid() const;
           ^~~
/work/math/cantor/work/cantor-20.04.1/src/backends/python/pythonsession.cpp: In member function 'void PythonSession::readOutput()':
/work/math/cantor/work/cantor-20.04.1/src/backends/python/pythonsession.cpp:226:84: warning: 'QStringList QString::split(QChar, QString::SplitBehavior, Qt::CaseSensitivity) const' is deprecated: Use Qt::SplitBehavior variant instead [-Wdeprecated-declarations]
     const QStringList packages = m_output.split(messageEnd, QString::SkipEmptyParts);
                                                                                    ^
In file included from /usr/pkg/qt5/include/QtCore/qhashfunctions.h:44:0,
                 from /usr/pkg/qt5/include/QtCore/qlist.h:47,
                 from /usr/pkg/qt5/include/QtCore/qvariant.h:45,
                 from /usr/pkg/qt5/include/QtCore/qabstractitemmodel.h:43,
                 from /usr/pkg/qt5/include/QtCore/QAbstractTableModel:1,
                 from /work/math/cantor/work/cantor-20.04.1/src/lib/defaultvariablemodel.h:24,
                 from /work/math/cantor/work/cantor-20.04.1/src/backends/python/pythonsession.cpp:22:
/usr/pkg/qt5/include/QtCore/qstring.h:615:17: note: declared here
     QStringList split(QChar sep, SplitBehavior behavior,
                 ^~~~~
[ 31%] Building CXX object src/backends/qalculate/CMakeFiles/cantor_qalculatebackend.dir/qalculatesyntaxhelpobject.cpp.o
[ 32%] Building CXX object src/backends/qalculate/CMakeFiles/cantor_qalculatebackend.dir/qalculatebackend.cpp.o
/work/math/cantor/work/cantor-20.04.1/src/backends/python/pythonvariablemodel.cpp: In member function 'void PythonVariableModel::extractVariables(Cantor::Expression::Status)':
/work/math/cantor/work/cantor-20.04.1/src/backends/python/pythonvariablemodel.cpp:67:91: warning: 'QStringList QString::split(QChar, QString::SplitBehavior, Qt::CaseSensitivity) const' is deprecated: Use Qt::SplitBehavior variant instead [-Wdeprecated-declarations]
                 const QStringList& records = data.split(QChar(18), QString::SkipEmptyParts);
                                                                                           ^
In file included from /usr/pkg/qt5/include/QtCore/qhashfunctions.h:44:0,
                 from /usr/pkg/qt5/include/QtCore/qlist.h:47,
                 from /usr/pkg/qt5/include/QtCore/qvariant.h:45,
                 from /usr/pkg/qt5/include/QtCore/qabstractitemmodel.h:43,
                 from /usr/pkg/qt5/include/QtCore/QAbstractTableModel:1,
                 from /work/math/cantor/work/cantor-20.04.1/src/lib/defaultvariablemodel.h:24,
                 from /work/math/cantor/work/cantor-20.04.1/src/backends/python/pythonvariablemodel.h:24,
                 from /work/math/cantor/work/cantor-20.04.1/src/backends/python/pythonvariablemodel.cpp:21:
/usr/pkg/qt5/include/QtCore/qstring.h:615:17: note: declared here
     QStringList split(QChar sep, SplitBehavior behavior,
                 ^~~~~
Scanning dependencies of target cantor_invertmatrixassistant_autogen
[ 32%] Automatic MOC for target cantor_invertmatrixassistant
[ 32%] Building CXX object src/backends/python/CMakeFiles/cantor_pythonbackend.dir/qrc_python.cpp.o
[ 32%] Building CXX object src/backends/python/CMakeFiles/cantor_pythonbackend.dir/settings.cpp.o
[ 32%] Built target cantor_invertmatrixassistant_autogen
[ 32%] Building CXX object src/backends/qalculate/CMakeFiles/cantor_qalculatebackend.dir/settings.cpp.o
Scanning dependencies of target cantor_eigenvectorsassistant_autogen
[ 32%] Automatic MOC for target cantor_eigenvectorsassistant
[ 32%] Built target cantor_eigenvectorsassistant_autogen
Scanning dependencies of target cantor_eigenvaluesassistant_autogen
[ 33%] Automatic MOC for target cantor_eigenvaluesassistant
[ 34%] Linking CXX shared module cantor_pythonbackend.so
Scanning dependencies of target cantor_runscriptassistant
[ 34%] Building CXX object src/assistants/runscript/CMakeFiles/cantor_runscriptassistant.dir/cantor_runscriptassistant_autogen/mocs_compilation.cpp.o
[ 35%] Building CXX object src/assistants/runscript/CMakeFiles/cantor_runscriptassistant.dir/runscriptassistant.cpp.o
[ 35%] Built target cantor_eigenvaluesassistant_autogen
Scanning dependencies of target cantor_plot2dassistant_autogen
[ 36%] Linking CXX shared module cantor_qalculatebackend.so
[ 36%] Automatic MOC for target cantor_plot2dassistant
/usr/bin/ld: warning: libstdc++.so.8, needed by /work/math/cantor/work/.buildlink/lib/libKF5SyntaxHighlighting.so, may conflict with libstdc++.so.7
/usr/lib/librpcsvc.so.1: warning: warning: this program uses xdr_peername(), which is deprecated and buggy.
/usr/lib/librpcsvc.so.1: warning: warning: this program uses xdr_domainname(), which is deprecated and buggy.
/usr/lib/librpcsvc.so.1: warning: warning: this program uses xdr_mapname(), which is deprecated and buggy.
[ 36%] Built target cantor_pythonbackend
Scanning dependencies of target cantor_plot3dassistant_autogen
[ 36%] Automatic MOC for target cantor_plot3dassistant
[ 36%] Built target cantor_plot2dassistant_autogen
Scanning dependencies of target cantor_advancedplotassistant_autogen
[ 36%] Automatic MOC for target cantor_advancedplotassistant
/usr/bin/ld: warning: libstdc++.so.8, needed by /work/math/cantor/work/.buildlink/lib/libqalculate.so, may conflict with libstdc++.so.7
/usr/lib/librpcsvc.so.1: warning: warning: this program uses xdr_peername(), which is deprecated and buggy.
/usr/lib/librpcsvc.so.1: warning: warning: this program uses xdr_domainname(), which is deprecated and buggy.
/usr/lib/librpcsvc.so.1: warning: warning: this program uses xdr_mapname(), which is deprecated and buggy.
CMakeFiles/cantor_qalculatebackend.dir/qalculatesyntaxhelpobject.cpp.o: In function `QalculateSyntaxHelpObject::fetchInformation()':
qalculatesyntaxhelpobject.cpp:(.text+0x4132): undefined reference to `Calculator::getActiveExpressionItem(std::__cxx11::basic_string<char, std::char_traits<char>, std::allocator<char> >, ExpressionItem*)'
qalculatesyntaxhelpobject.cpp:(.text+0x431f): undefined reference to `Argument::Argument(std::__cxx11::basic_string<char, std::char_traits<char>, std::allocator<char> >, bool, bool)'
qalculatesyntaxhelpobject.cpp:(.text+0x4369): undefined reference to `Argument::name[abi:cxx11]() const'
qalculatesyntaxhelpobject.cpp:(.text+0x43a0): undefined reference to `Argument::name[abi:cxx11]() const'
qalculatesyntaxhelpobject.cpp:(.text+0x446d): undefined reference to `Calculator::getComma[abi:cxx11]() const'
qalculatesyntaxhelpobject.cpp:(.text+0x473d): undefined reference to `Argument::Argument(std::__cxx11::basic_string<char, std::char_traits<char>, std::allocator<char> >, bool, bool)'
qalculatesyntaxhelpobject.cpp:(.text+0x47b2): undefined reference to `Argument::name[abi:cxx11]() const'
qalculatesyntaxhelpobject.cpp:(.text+0x47e2): undefined reference to `Argument::name[abi:cxx11]() const'
qalculatesyntaxhelpobject.cpp:(.text+0x487f): undefined reference to `Argument::printlong[abi:cxx11]() const'
qalculatesyntaxhelpobject.cpp:(.text+0x495a): undefined reference to `MathFunction::getDefaultValue[abi:cxx11](unsigned long) const'
qalculatesyntaxhelpobject.cpp:(.text+0x49d7): undefined reference to `MathFunction::getDefaultValue[abi:cxx11](unsigned long) const'
qalculatesyntaxhelpobject.cpp:(.text+0x4f3f): undefined reference to `Argument::printlong[abi:cxx11]() const'
qalculatesyntaxhelpobject.cpp:(.text+0x51ae): undefined reference to `Calculator::getComma[abi:cxx11]() const'
CMakeFiles/cantor_qalculatebackend.dir/qalculatehighlighter.cpp.o: In function `QalculateHighlighter::highlightBlock(QString const&)':
qalculatehighlighter.cpp:(.text+0x5b4): undefined reference to `Calculator::parse(std::__cxx11::basic_string<char, std::char_traits<char>, std::allocator<char> >, ParseOptions const&)'
qalculatehighlighter.cpp:(.text+0x7ca): undefined reference to `Calculator::getFunction(std::__cxx11::basic_string<char, std::char_traits<char>, std::allocator<char> >)'
CMakeFiles/cantor_qalculatebackend.dir/qalculateexpression.cpp.o: In function `QalculateExpression::unlocalizeExpression[abi:cxx11](QString)':
qalculateexpression.cpp:(.text+0x73b): undefined reference to `Calculator::unlocalizeExpression(std::__cxx11::basic_string<char, std::char_traits<char>, std::allocator<char> >, ParseOptions const&) const'
CMakeFiles/cantor_qalculatebackend.dir/qalculateexpression.cpp.o: In function `QalculateExpression::checkForCalculatorMessages()':
qalculateexpression.cpp:(.text+0x1422): undefined reference to `CalculatorMessage::message[abi:cxx11]() const'
qalculateexpression.cpp:(.text+0x171e): undefined reference to `CalculatorMessage::message[abi:cxx11]() const'
CMakeFiles/cantor_qalculatebackend.dir/qalculateexpression.cpp.o: In function `QalculateExpression::evaluatePlotCommand()':
qalculateexpression.cpp:(.text+0x334d): undefined reference to `Calculator::expressionToPlotVector(std::__cxx11::basic_string<char, std::char_traits<char>, std::allocator<char> >, MathStructure const&, MathStructure const&, MathStructure const&, MathStructure*, std::__cxx11::basic_string<char, std::char_traits<char>, std::allocator<char> >, ParseOptions const&, int)'
qalculateexpression.cpp:(.text+0x3fca): undefined reference to `Calculator::expressionToPlotVector(std::__cxx11::basic_string<char, std::char_traits<char>, std::allocator<char> >, MathStructure const&, MathStructure const&, int, MathStructure*, std::__cxx11::basic_string<char, std::char_traits<char>, std::allocator<char> >, ParseOptions const&, int)'
qalculateexpression.cpp:(.text+0x4286): undefined reference to `Calculator::calculate(std::__cxx11::basic_string<char, std::char_traits<char>, std::allocator<char> >, EvaluationOptions const&, MathStructure*, MathStructure*, bool)'
qalculateexpression.cpp:(.text+0x4473): undefined reference to `Calculator::calculate(std::__cxx11::basic_string<char, std::char_traits<char>, std::allocator<char> >, EvaluationOptions const&, MathStructure*, MathStructure*, bool)'
qalculateexpression.cpp:(.text+0x4d2e): undefined reference to `Calculator::calculate(std::__cxx11::basic_string<char, std::char_traits<char>, std::allocator<char> >, EvaluationOptions const&, MathStructure*, MathStructure*, bool)'
qalculateexpression.cpp:(.text+0x631f): undefined reference to `Calculator::calculate(std::__cxx11::basic_string<char, std::char_traits<char>, std::allocator<char> >, EvaluationOptions const&, MathStructure*, MathStructure*, bool)'
qalculateexpression.cpp:(.text+0x6453): undefined reference to `Calculator::calculate(std::__cxx11::basic_string<char, std::char_traits<char>, std::allocator<char> >, EvaluationOptions const&, MathStructure*, MathStructure*, bool)'
CMakeFiles/cantor_qalculatebackend.dir/qalculateexpression.cpp.o:qalculateexpression.cpp:(.text+0x66b3): more undefined references to `Calculator::calculate(std::__cxx11::basic_string<char, std::char_traits<char>, std::allocator<char> >, EvaluationOptions const&, MathStructure*, MathStructure*, bool)' follow
CMakeFiles/cantor_qalculatebackend.dir/qalculatecompletionobject.cpp.o: In function `QalculateCompletionObject::fetchIdentifierType()':
qalculatecompletionobject.cpp:(.text+0x1e6): undefined reference to `Calculator::getVariable(std::__cxx11::basic_string<char, std::char_traits<char>, std::allocator<char> >)'
qalculatecompletionobject.cpp:(.text+0x325): undefined reference to `Calculator::getFunction(std::__cxx11::basic_string<char, std::char_traits<char>, std::allocator<char> >)'
collect2: error: ld returned 1 exit status
--- src/backends/qalculate/cantor_qalculatebackend.so ---
*** [src/backends/qalculate/cantor_qalculatebackend.so] Error code 1

make[2]: stopped in /work/math/cantor/work/cantor-20.04.1/_KDE_build
1 error

make[2]: stopped in /work/math/cantor/work/cantor-20.04.1/_KDE_build
--- src/backends/qalculate/CMakeFiles/cantor_qalculatebackend.dir/all ---
*** [src/backends/qalculate/CMakeFiles/cantor_qalculatebackend.dir/all] Error code 2

make[1]: stopped in /work/math/cantor/work/cantor-20.04.1/_KDE_build
A failure has been detected in another branch of the parallel make

make[2]: stopped in /work/math/cantor/work/cantor-20.04.1/_KDE_build
--- src/assistants/plot3d/CMakeFiles/cantor_plot3dassistant_autogen.dir/all ---
*** [src/assistants/plot3d/CMakeFiles/cantor_plot3dassistant_autogen.dir/all] Error code 2

make[1]: stopped in /work/math/cantor/work/cantor-20.04.1/_KDE_build
A failure has been detected in another branch of the parallel make

make[2]: stopped in /work/math/cantor/work/cantor-20.04.1/_KDE_build
--- src/assistants/advancedplot/CMakeFiles/cantor_advancedplotassistant_autogen.dir/all ---
*** [src/assistants/advancedplot/CMakeFiles/cantor_advancedplotassistant_autogen.dir/all] Error code 2

make[1]: stopped in /work/math/cantor/work/cantor-20.04.1/_KDE_build
A failure has been detected in another branch of the parallel make

make[2]: stopped in /work/math/cantor/work/cantor-20.04.1/_KDE_build
--- src/assistants/runscript/CMakeFiles/cantor_runscriptassistant.dir/all ---
*** [src/assistants/runscript/CMakeFiles/cantor_runscriptassistant.dir/all] Error code 2

make[1]: stopped in /work/math/cantor/work/cantor-20.04.1/_KDE_build
4 errors

make[1]: stopped in /work/math/cantor/work/cantor-20.04.1/_KDE_build
*** [all] Error code 2

make: stopped in /work/math/cantor/work/cantor-20.04.1/_KDE_build
1 error

make: stopped in /work/math/cantor/work/cantor-20.04.1/_KDE_build
*** Error code 2

Stop.
make[1]: stopped in /tree/pkgsrc/math/cantor
*** Error code 1

Stop.
make: stopped in /tree/pkgsrc/math/cantor