=> Bootstrap dependency digest>=20010302: found digest-20190127
===> Skipping vulnerability checks.
WARNING: No /usr/pkg/pkgdb/pkg-vulnerabilities file found.
WARNING: To fix run: `/usr/sbin/pkg_admin -K /usr/pkg/pkgdb fetch-pkg-vulnerabilities'.
===> Building for fdtools-2021.04.30
cd /scratch/work/sysutils/fdtools/work/misc/fdtools-2021.04.30 && /usr/bin/env USETOOLS=no CC=gcc CFLAGS=-O2\ -D_FORTIFY_SOURCE=2\ -I/usr/pkg/include CPPFLAGS=-I\ /usr/pkg/include\ -Dpathexec=mexec\ -Dpathexec0=mexec0\ -Dpathexec_run=exec_ae\ -Dpathexec_env=env_mexec\ -I/usr/pkg/include CXX=c++ CXXFLAGS=-O2\ -D_FORTIFY_SOURCE=2\ -I/usr/pkg/include COMPILER_RPATH_FLAG=-Wl,-R F77=g77 FC=g77 FFLAGS=-O LANG=C LC_ALL=C LC_COLLATE=C LC_CTYPE=C LC_MESSAGES=C LC_MONETARY=C LC_NUMERIC=C LC_TIME=C LDFLAGS=-L\ /usr/pkg/lib/skalibs\ -L/usr/pkg/lib\ -Wl,-R/usr/pkg/lib LINKER_RPATH_FLAG=-R PATH=/scratch/work/sysutils/fdtools/work/.cwrapper/bin:/scratch/work/sysutils/fdtools/work/.buildlink/bin:/scratch/work/sysutils/fdtools/work/.gcc/bin:/scratch/work/sysutils/fdtools/work/.tools/bin:/usr/pkg/bin:/sbin:/bin:/usr/sbin:/usr/bin:/usr/pkg/bin:/usr/X11R7/bin PREFIX=/usr/pkg MAKELEVEL=0 CONFIG_SITE= PKG_SYSCONFDIR=/usr/pkg/etc CXXCPP=cpp HOME=/scratch/work/sysutils/fdtools/work/.home CWRAPPERS_CONFIG_DIR=/scratch/work/sysutils/fdtools/work/.cwrapper/config CPP=cpp LOCALBASE=/usr/pkg X11BASE=/usr/X11R7 PKGMANDIR=man PKGINFODIR=info PKGGNUDIR=gnu/ MAKECONF=/dev/null OBJECT_FMT=ELF USETOOLS=no BSD_INSTALL_PROGRAM=/usr/bin/install\ -c\ -s\ -o\ pbulk\ -g\ users\ -m\ 755 BSD_INSTALL_SCRIPT=/usr/bin/install\ -c\ -o\ pbulk\ -g\ users\ -m\ 755 BSD_INSTALL_LIB=/usr/bin/install\ -c\ -o\ pbulk\ -g\ users\ -m\ 755 BSD_INSTALL_DATA=/usr/bin/install\ -c\ -o\ pbulk\ -g\ users\ -m\ 644 BSD_INSTALL_MAN=/usr/bin/install\ -c\ -o\ pbulk\ -g\ users\ -m\ 644 BSD_INSTALL=/usr/bin/install BSD_INSTALL_PROGRAM_DIR=/usr/bin/install\ -d\ -o\ pbulk\ -g\ users\ -m\ 755 BSD_INSTALL_SCRIPT_DIR=/usr/bin/install\ -d\ -o\ pbulk\ -g\ users\ -m\ 755 BSD_INSTALL_LIB_DIR=/usr/bin/install\ -d\ -o\ pbulk\ -g\ users\ -m\ 755 BSD_INSTALL_DATA_DIR=/usr/bin/install\ -d\ -o\ pbulk\ -g\ users\ -m\ 755 BSD_INSTALL_MAN_DIR=/usr/bin/install\ -d\ -o\ pbulk\ -g\ users\ -m\ 755 BSD_INSTALL_GAME=/usr/bin/install\ -c\ -s\ -o\ pbulk\ -g\ users\ -m\ 2555 BSD_INSTALL_GAME_DATA=/usr/bin/install\ -c\ -o\ pbulk\ -g\ users\ -m\ 664 BSD_INSTALL_GAME_DIR=/usr/bin/install\ -d\ -o\ pbulk\ -g\ users\ -m\ 775 INSTALL_INFO= MAKEINFO=/scratch/work/sysutils/fdtools/work/.tools/bin/makeinfo FLEX= BISON= ITSTOOL=/scratch/work/sysutils/fdtools/work/.tools/bin/itstool GDBUS_CODEGEN=/scratch/work/sysutils/fdtools/work/.tools/bin/gdbus-codegen PKG_CONFIG= PKG_CONFIG_LIBDIR=/scratch/work/sysutils/fdtools/work/.buildlink/lib/pkgconfig:/scratch/work/sysutils/fdtools/work/.buildlink/share/pkgconfig PKG_CONFIG_LOG=/scratch/work/sysutils/fdtools/work/.pkg-config.log PKG_CONFIG_PATH= CWRAPPERS_CONFIG_DIR=/scratch/work/sysutils/fdtools/work/.cwrapper/config package/compile 
Creating directories

Making compile/conf/host_link.sh

Making compile/conf/host_compile.sh

Making compile/host/grabconsole.o

Making compile/conf/host_library.sh

Making compile/host/fd_shuffle.o

Making compile/host/fd_xfer_ucspi.o

Making compile/host/fd_xfer_child.o

Making compile/host/fd_xfer_send.o

Making compile/host/fd_xfer_recv.o

Making compile/host/fd_grabconsole.o

Making compile/host/fd_scan_or_open.o

Making compile/host/fdtools.a

Making compile/host/grabconsole

Making command/grabconsole

Making compile/host/multitee.o

Making compile/host/sigsched.o

Making compile/host/multitee

Making command/multitee

Making compile/host/pipecycle.o

Making compile/host/prjlibs-c/vec_trunc.o

Making compile/host/prjlibs-c/vec_shift.o

Making compile/host/prjlibs-c/vec_insn.o

Making compile/host/prjlibs-c/vec_init.o

Making compile/host/prjlibs-c/vec_free.o

Making compile/host/prjlibs-c/vec_diffi.o

Making compile/host/prjlibs-c/vec_cutn.o

Making compile/host/prjlibs-c/vec_allocfit.o

Making compile/host/prjlibs-c/vec_alloc.o

Making compile/host/prjlibs-c/vec.a

Making compile/host/pipecycle

Making command/pipecycle

Making compile/host/recvfd.o

Making compile/host/recvfd

Making command/recvfd

Making compile/host/seek0.o

Making compile/host/check_exit_exec.o

Making compile/host/seek0

Making command/seek0

Making compile/host/sendfd.o

Making compile/host/sendfd

Making command/sendfd

Making compile/host/setblock.o

Making compile/host/setblock

Making command/setblock

Making compile/host/prjlibs-c/sys_param-1.o

Making compile/host/prjlibs-c/sys_param.h

Making compile/host/setstate.o

Making compile/host/setstate

Making command/setstate

Making compile/host/statfile.o
src/statfile.c: In function 'main':
src/statfile.c:103:28: warning: comparison between signed and unsigned integer expressions [-Wsign-compare]
         statbuf.st_##member!=(type)(unsigned long)statbuf.st_##member) \
                            ^
src/statfile.c:118:3: note: in expansion of macro 'doit'
   doit(blksize, "BLKSIZE", unsigned long);
   ^

Making compile/conf/depend_skalibs_sysdeps

Making compile/host/skalibs_sysdeps

Making compile/host/tainnow

Making compile/host/prjlibs-c/nsec-1.o

Making compile/host/prjlibs-c/nsec.o

Making compile/host/statfile
gcc: error: Checking: No such file or directory
gcc: error: whether: No such file or directory
gcc: error: system: No such file or directory
gcc: error: has: No such file or directory
gcc: error: CLOCK_MONOTONIC...: No such file or directory
gcc: error: ...: No such file or directory
gcc: error: yes: No such file or directory
gcc: error: Checking: No such file or directory
gcc: error: whether: No such file or directory
gcc: error: system: No such file or directory
gcc: error: has: No such file or directory
gcc: error: CLOCK_BOOTTIME...: No such file or directory
gcc: error: ...: No such file or directory
gcc: error: no: No such file or directory
gcc: error: Checking: No such file or directory
gcc: error: whether: No such file or directory
gcc: error: system: No such file or directory
gcc: error: has: No such file or directory
gcc: error: posix_spawn()...: No such file or directory
gcc: error: ...: No such file or directory
gcc: error: yes: No such file or directory

Making compile/host/vc-get-linux.o
src/vc-get-linux.c:9:20: fatal error: sys/vt.h: No such file or directory
compilation terminated.

Making compile/host/vc-get-default.o

Making compile/host/vc-get.o

Making compile/host/vc-get

Making command/vc-get

Making compile/host/vc-lock-linux.o
src/vc-lock-linux.c:9:20: fatal error: sys/vt.h: No such file or directory
compilation terminated.

Making compile/host/vc-lock-default.o

Making compile/host/vc-lock.o

Making compile/host/vc-lock
gcc: error: Checking: No such file or directory
gcc: error: whether: No such file or directory
gcc: error: system: No such file or directory
gcc: error: has: No such file or directory
gcc: error: CLOCK_MONOTONIC...: No such file or directory
gcc: error: ...: No such file or directory
gcc: error: yes: No such file or directory
gcc: error: Checking: No such file or directory
gcc: error: whether: No such file or directory
gcc: error: system: No such file or directory
gcc: error: has: No such file or directory
gcc: error: CLOCK_BOOTTIME...: No such file or directory
gcc: error: ...: No such file or directory
gcc: error: no: No such file or directory
gcc: error: Checking: No such file or directory
gcc: error: whether: No such file or directory
gcc: error: system: No such file or directory
gcc: error: has: No such file or directory
gcc: error: posix_spawn()...: No such file or directory
gcc: error: ...: No such file or directory
gcc: error: yes: No such file or directory

Making compile/host/vc-switch-linux.o
src/vc-switch-linux.c:9:20: fatal error: sys/vt.h: No such file or directory
compilation terminated.

Making compile/host/vc-switch-default.o

Making compile/host/vc-switch.o

Making compile/host/vc-switch

Making command/vc-switch

Making include/fdtools.h

Making library/fdtools.a

The following files were not made successfully:
command/statfile
command/vc-lock
*** Error code 1

Stop.
make[1]: stopped in /tree/pkgsrc/sysutils/fdtools
*** Error code 1

Stop.
make: stopped in /tree/pkgsrc/sysutils/fdtools