=> Bootstrap dependency digest>=20211023: found digest-20220214
WARNING: [license.mk] Every package should define a LICENSE.
===> Skipping vulnerability checks.
WARNING: No /usr/pkg/pkgdb/pkg-vulnerabilities file found.
WARNING: To fix run: `/usr/sbin/pkg_admin -K /usr/pkg/pkgdb fetch-pkg-vulnerabilities'.
===> Building for xf86-video-ast-1.1.5nb1
--- all ---
/usr/bin/make  all-recursive
--- all-recursive ---
Making all in src
--- ast_2dtool.lo ---
--- ast_accel.lo ---
--- ast_cursor.lo ---
--- ast_driver.lo ---
--- ast_2dtool.lo ---
  CC       ast_2dtool.lo
--- ast_accel.lo ---
  CC       ast_accel.lo
--- ast_driver.lo ---
  CC       ast_driver.lo
--- ast_cursor.lo ---
  CC       ast_cursor.lo
In file included from ast_cursor.c:24:0:
../config.h:4:10: fatal error: xorg-server.h: No such file or directory
 #include "xorg-server.h"
          ^~~~~~~~~~~~~~~
compilation terminated.
--- ast_accel.lo ---
In file included from ast_accel.c:24:0:
../config.h:4:10: fatal error: xorg-server.h: No such file or directory
 #include "xorg-server.h"
          ^~~~~~~~~~~~~~~
compilation terminated.
--- ast_driver.lo ---
In file included from ast_driver.c:24:0:
../config.h:4:10: fatal error: xorg-server.h: No such file or directory
 #include "xorg-server.h"
          ^~~~~~~~~~~~~~~
compilation terminated.
--- ast_cursor.lo ---
*** [ast_cursor.lo] Error code 1

make[2]: stopped in /work/x11/xf86-video-ast/work/xf86-video-ast-1.1.5/src
--- ast_accel.lo ---
*** [ast_accel.lo] Error code 1

make[2]: stopped in /work/x11/xf86-video-ast/work/xf86-video-ast-1.1.5/src
--- ast_driver.lo ---
*** [ast_driver.lo] Error code 1

make[2]: stopped in /work/x11/xf86-video-ast/work/xf86-video-ast-1.1.5/src
--- ast_2dtool.lo ---
In file included from ast_2dtool.c:24:0:
../config.h:4:10: fatal error: xorg-server.h: No such file or directory
 #include "xorg-server.h"
          ^~~~~~~~~~~~~~~
compilation terminated.
*** [ast_2dtool.lo] Error code 1

make[2]: stopped in /work/x11/xf86-video-ast/work/xf86-video-ast-1.1.5/src
4 errors

make[2]: stopped in /work/x11/xf86-video-ast/work/xf86-video-ast-1.1.5/src
*** [all-recursive] Error code 1

make[1]: stopped in /work/x11/xf86-video-ast/work/xf86-video-ast-1.1.5
1 error

make[1]: stopped in /work/x11/xf86-video-ast/work/xf86-video-ast-1.1.5
*** [all] Error code 2

make: stopped in /work/x11/xf86-video-ast/work/xf86-video-ast-1.1.5
1 error

make: stopped in /work/x11/xf86-video-ast/work/xf86-video-ast-1.1.5
*** Error code 2

Stop.
make[1]: stopped in /tree/pkgsrc/x11/xf86-video-ast
*** Error code 1

Stop.
make: stopped in /tree/pkgsrc/x11/xf86-video-ast