=> Bootstrap dependency digest>=20211023: found digest-20220214
===> Skipping vulnerability checks.
WARNING: No /usr/pkg/pkgdb/pkg-vulnerabilities file found.
WARNING: To fix run: `/usr/sbin/pkg_admin -K /usr/pkg/pkgdb fetch-pkg-vulnerabilities'.
===> Building for xf86-video-nv-2.1.21nb1
--- all ---
/usr/bin/make  all-recursive
--- all-recursive ---
Making all in src
--- nv_cursor.lo ---
--- nv_dac.lo ---
--- nv_dga.lo ---
--- nv_driver.lo ---
--- nv_cursor.lo ---
  CC       nv_cursor.lo
--- nv_dac.lo ---
  CC       nv_dac.lo
--- nv_dga.lo ---
  CC       nv_dga.lo
--- nv_driver.lo ---
  CC       nv_driver.lo
In file included from nv_driver.c:25:0:
../config.h:4:10: fatal error: xorg-server.h: No such file or directory
 #include "xorg-server.h"
          ^~~~~~~~~~~~~~~
--- nv_dac.lo ---
In file included from nv_dac.c:25:0:
../config.h:4:10: fatal error: xorg-server.h: No such file or directory
 #include "xorg-server.h"
          ^~~~~~~~~~~~~~~
compilation terminated.
--- nv_driver.lo ---
compilation terminated.
*** [nv_driver.lo] Error code 1

make[2]: stopped in /work/x11/xf86-video-nv/work/xf86-video-nv-2.1.21/src
--- nv_dac.lo ---
*** [nv_dac.lo] Error code 1

make[2]: stopped in /work/x11/xf86-video-nv/work/xf86-video-nv-2.1.21/src
--- nv_dga.lo ---
In file included from nv_dga.c:2:0:
../config.h:4:10: fatal error: xorg-server.h: No such file or directory
 #include "xorg-server.h"
          ^~~~~~~~~~~~~~~
compilation terminated.
--- nv_cursor.lo ---
In file included from nv_cursor.c:25:0:
../config.h:4:10: fatal error: xorg-server.h: No such file or directory
 #include "xorg-server.h"
          ^~~~~~~~~~~~~~~
compilation terminated.
--- nv_dga.lo ---
*** [nv_dga.lo] Error code 1

make[2]: stopped in /work/x11/xf86-video-nv/work/xf86-video-nv-2.1.21/src
--- nv_cursor.lo ---
*** [nv_cursor.lo] Error code 1

make[2]: stopped in /work/x11/xf86-video-nv/work/xf86-video-nv-2.1.21/src
4 errors

make[2]: stopped in /work/x11/xf86-video-nv/work/xf86-video-nv-2.1.21/src
*** [all-recursive] Error code 1

make[1]: stopped in /work/x11/xf86-video-nv/work/xf86-video-nv-2.1.21
1 error

make[1]: stopped in /work/x11/xf86-video-nv/work/xf86-video-nv-2.1.21
*** [all] Error code 2

make: stopped in /work/x11/xf86-video-nv/work/xf86-video-nv-2.1.21
1 error

make: stopped in /work/x11/xf86-video-nv/work/xf86-video-nv-2.1.21
*** Error code 2

Stop.
make[1]: stopped in /tree/pkgsrc/x11/xf86-video-nv
*** Error code 1

Stop.
make: stopped in /tree/pkgsrc/x11/xf86-video-nv