=> Bootstrap dependency digest>=20211023: found digest-20220214
===> Skipping vulnerability checks.
WARNING: No /usr/pkg/pkgdb/pkg-vulnerabilities file found.
WARNING: To fix run: `/usr/sbin/pkg_admin -K /usr/pkg/pkgdb fetch-pkg-vulnerabilities'.
===> Building for buzztrax-0.10.2nb14
  GEN      src/lib/core/marshal.c
  GEN      src/lib/core/marshal.h
INFO: Reading src/lib/core/marshal.list...
INFO: Reading src/lib/core/marshal.list...
  GEN      src/ui/edit/marshal.c
  GEN      src/ui/edit/marshal.h
INFO: Reading src/ui/edit/marshal.list...
  GEN      src/ui/edit/authors.h
  CP     tmp-orc.c
  CP     src/gst/bml/gstbmlorc.h
INFO: Reading src/ui/edit/marshal.list...
/usr/pkg/bin/gmake  all-recursive
gmake[1]: Entering directory '/scratch/work/audio/buzztrax/work/buzztrax-0.10.2'
Making all in po
gmake[2]: Entering directory '/scratch/work/audio/buzztrax/work/buzztrax-0.10.2/po'
  MSGFMT cs.gmo
  MSGFMT da.gmo
  MSGFMT de.gmo
  MSGFMT fr.gmo
  MSGFMT fi.gmo
  MSGFMT id.gmo
  MSGFMT nl.gmo
  MSGFMT nn.gmo
  MSGFMT sv.gmo
  MSGFMT vi.gmo
  MSGFMT zh_CN.gmo
gmake[2]: Leaving directory '/scratch/work/audio/buzztrax/work/buzztrax-0.10.2/po'
Making all in docs/help/bt-edit
gmake[2]: Entering directory '/scratch/work/audio/buzztrax/work/buzztrax-0.10.2/docs/help/bt-edit'
Making all in C
gmake[3]: Entering directory '/scratch/work/audio/buzztrax/work/buzztrax-0.10.2/docs/help/bt-edit/C'
gmake[3]: Leaving directory '/scratch/work/audio/buzztrax/work/buzztrax-0.10.2/docs/help/bt-edit/C'
gmake[3]: Entering directory '/scratch/work/audio/buzztrax/work/buzztrax-0.10.2/docs/help/bt-edit'
gmake[3]: Nothing to be done for 'all-am'.
gmake[3]: Leaving directory '/scratch/work/audio/buzztrax/work/buzztrax-0.10.2/docs/help/bt-edit'
gmake[2]: Leaving directory '/scratch/work/audio/buzztrax/work/buzztrax-0.10.2/docs/help/bt-edit'
gmake[2]: Entering directory '/scratch/work/audio/buzztrax/work/buzztrax-0.10.2'
  CCLD     libloader.la
  CC       src/gst/bml/libgstbml_la-plugin.lo
  CC       src/gst/bml/libgstbml_la-common.lo
  CC       libgstbml_la-tmp-orc.lo
  CC       src/ui/cmd/bt-cmd.o
  CC       src/ui/edit/buzztrax_edit-bt-edit.o
  ITMRG  buzztrax.appdata.xml
  ITMRG  src/lib/core/songio/bsl/buzztrax-songio-buzz.desktop
  ITMRG  src/ui/edit/buzztrax-edit.desktop
  ITMRG  src/lib/core/songio/bsl/buzztrax-songio-buzz.xml
  GEN      org.buzztrax.gschema.valid
  CC       src/lib/bml/libbml_la-bml.lo
src/lib/bml/bml.c: In function 'bml_setup':
src/lib/bml/bml.c:865:8: warning: implicit declaration of function '_bmlw_setup' [-Wimplicit-function-declaration]
   if (!_bmlw_setup (logger)) {
        ^
src/lib/bml/bml.c: In function 'bml_finalize':
src/lib/bml/bml.c:1045:3: warning: implicit declaration of function '_bmlw_finalize' [-Wimplicit-function-declaration]
   _bmlw_finalize ();
   ^
  CC       src/lib/bml/libbml_la-bmllog.lo
  CC       src/lib/bml/libbml_la-bmlw.lo
src/lib/bml/bmlw.c:22:19: fatal error: win32.h: No such file or directory
compilation terminated.
gmake[2]: *** [Makefile:4496: src/lib/bml/libbml_la-bmlw.lo] Error 1
gmake[2]: *** Waiting for unfinished jobs....
gmake[2]: Leaving directory '/scratch/work/audio/buzztrax/work/buzztrax-0.10.2'
gmake[1]: *** [Makefile:6971: all-recursive] Error 1
gmake[1]: Leaving directory '/scratch/work/audio/buzztrax/work/buzztrax-0.10.2'
gmake: *** [Makefile:2709: all] Error 2
*** Error code 2

Stop.
make[1]: stopped in /tree/pkgsrc/audio/buzztrax
*** Error code 1

Stop.
make: stopped in /tree/pkgsrc/audio/buzztrax