=> Bootstrap dependency digest>=20211023: found digest-20220214
===> Skipping vulnerability checks.
WARNING: No /usr/pkg/pkgdb/pkg-vulnerabilities file found.
WARNING: To fix run: `/usr/sbin/pkg_admin -K /usr/pkg/pkgdb fetch-pkg-vulnerabilities'.
===> Building for picotrace-20200318
--- all-coredumper ---
--- all-picotrace ---
--- all-coredumper ---
all ===> coredumper
--- all-picotrace ---
all ===> picotrace
--- .gdbinit ---
--- all-coredumper ---
--- .gdbinit ---
--- all-picotrace ---
rm -f .gdbinit
--- all-coredumper ---
rm -f .gdbinit
--- all-picotrace ---
touch .gdbinit
--- all-coredumper ---
touch .gdbinit
--- all-picotrace ---
--- picotrace.o ---
--- all-coredumper ---
--- coredumper.o ---
--- all-picotrace ---
#   compile  picotrace/picotrace.o
gcc -O2 -fPIC -D_FORTIFY_SOURCE=2 -fPIE -pthread   -std=gnu99       -I../common  -c    picotrace.c
--- all-coredumper ---
#   compile  coredumper/coredumper.o
gcc -O2 -fPIC -D_FORTIFY_SOURCE=2 -fPIE -pthread   -std=gnu99       -I../common  -c    coredumper.c
--- all-picotrace ---
picotrace.c:39:21: fatal error: threads.h: No such file or directory
compilation terminated.
--- all-coredumper ---
coredumper.c:39:21: fatal error: threads.h: No such file or directory
compilation terminated.
--- all-picotrace ---
*** [picotrace.o] Error code 1

make[1]: stopped in /work/devel/picotrace/work/picotrace-20200318/picotrace
1 error

make[1]: stopped in /work/devel/picotrace/work/picotrace-20200318/picotrace
*** [all-picotrace] Error code 2

make: stopped in /work/devel/picotrace/work/picotrace-20200318
--- all-coredumper ---
*** [coredumper.o] Error code 1

make[1]: stopped in /work/devel/picotrace/work/picotrace-20200318/coredumper
1 error

make[1]: stopped in /work/devel/picotrace/work/picotrace-20200318/coredumper
*** [all-coredumper] Error code 2

make: stopped in /work/devel/picotrace/work/picotrace-20200318
2 errors

make: stopped in /work/devel/picotrace/work/picotrace-20200318
*** Error code 2

Stop.
make[1]: stopped in /tree/pkgsrc/devel/picotrace
*** Error code 1

Stop.
make: stopped in /tree/pkgsrc/devel/picotrace