=> Bootstrap dependency digest>=20211023: found digest-20220214
===> Skipping vulnerability checks.
WARNING: No /usr/pkg/pkgdb/pkg-vulnerabilities file found.
WARNING: To fix run: `/usr/sbin/pkg_admin -K /usr/pkg/pkgdb fetch-pkg-vulnerabilities'.
===> Building for u-boot-pinecube-2022.04
cd /scratch/work/sysutils/u-boot-pinecube/work/u-boot-2022.04 && /usr/bin/env USETOOLS=no PTHREAD_CFLAGS=\ -pthread\  PTHREAD_LDFLAGS=\ -pthread PTHREAD_LIBS= PTHREADBASE=/usr DL_CFLAGS=\ -pthread\  DL_LDFLAGS=\ -pthread DL_LIBS= CROSS_COMPILE=/usr/pkg/cross-arm-none-eabi/bin/arm-none-eabi- PYTHON=/usr/pkg/bin/python3.10 PYTHON3=/usr/pkg/bin/python3.10 PYTHONCONFIG=/usr/pkg/bin/python3.10-config PYTHONLIBPATH=-L/usr/pkg/lib CC=gcc CFLAGS=-O2\ -fPIC\ -D_FORTIFY_SOURCE=2\ -I/usr/include\ -I/usr/pkg/include/python3.10 CPPFLAGS=-I/usr/include\ -I/usr/pkg/include/python3.10 CXX=c++ CXXFLAGS=-O2\ -fPIC\ -D_FORTIFY_SOURCE=2\ -I/usr/include\ -I/usr/pkg/include/python3.10 COMPILER_RPATH_FLAG=-Wl,-R F77=g77 FC=g77 FFLAGS=-O LANG=C LC_ALL=C LC_COLLATE=C LC_CTYPE=C LC_MESSAGES=C LC_MONETARY=C LC_NUMERIC=C LC_TIME=C LDFLAGS=-Wl,-zrelro\ -L/usr/lib\ -Wl,-R/usr/lib\ -Wl,-R/usr/pkg/lib LINKER_RPATH_FLAG=-R PATH=/scratch/work/sysutils/u-boot-pinecube/work/.cwrapper/bin:/scratch/work/sysutils/u-boot-pinecube/work/.buildlink/bin:/scratch/work/sysutils/u-boot-pinecube/work/.gcc/bin:/scratch/work/sysutils/u-boot-pinecube/work/.tools/bin:/usr/pkg/bin:/sbin:/bin:/usr/sbin:/usr/bin:/usr/pkg/bin:/usr/X11R7/bin PREFIX=/usr/pkg MAKELEVEL=0 CONFIG_SITE= PKG_SYSCONFDIR=/usr/pkg/etc HOME=/scratch/work/sysutils/u-boot-pinecube/work/.home CWRAPPERS_CONFIG_DIR=/scratch/work/sysutils/u-boot-pinecube/work/.cwrapper/config CPP=cpp LOCALBASE=/usr/pkg X11BASE=/usr/X11R7 PKGMANDIR=man PKGINFODIR=info PKGGNUDIR=gnu/ MAKECONF=/dev/null OBJECT_FMT=ELF USETOOLS=no BSD_INSTALL_PROGRAM=/usr/bin/install\ -c\ -s\ -o\ pbulk\ -g\ users\ -m\ 755 BSD_INSTALL_SCRIPT=/usr/bin/install\ -c\ -o\ pbulk\ -g\ users\ -m\ 755 BSD_INSTALL_LIB=/usr/bin/install\ -c\ -o\ pbulk\ -g\ users\ -m\ 755 BSD_INSTALL_DATA=/usr/bin/install\ -c\ -o\ pbulk\ -g\ users\ -m\ 644 BSD_INSTALL_MAN=/usr/bin/install\ -c\ -o\ pbulk\ -g\ users\ -m\ 644 BSD_INSTALL=/usr/bin/install BSD_INSTALL_PROGRAM_DIR=/usr/bin/install\ -d\ -o\ pbulk\ -g\ users\ -m\ 755 BSD_INSTALL_SCRIPT_DIR=/usr/bin/install\ -d\ -o\ pbulk\ -g\ users\ -m\ 755 BSD_INSTALL_LIB_DIR=/usr/bin/install\ -d\ -o\ pbulk\ -g\ users\ -m\ 755 BSD_INSTALL_DATA_DIR=/usr/bin/install\ -d\ -o\ pbulk\ -g\ users\ -m\ 755 BSD_INSTALL_MAN_DIR=/usr/bin/install\ -d\ -o\ pbulk\ -g\ users\ -m\ 755 BSD_INSTALL_GAME=/usr/bin/install\ -c\ -s\ -o\ pbulk\ -g\ users\ -m\ 2555 BSD_INSTALL_GAME_DATA=/usr/bin/install\ -c\ -o\ pbulk\ -g\ users\ -m\ 664 BSD_INSTALL_GAME_DIR=/usr/bin/install\ -d\ -o\ pbulk\ -g\ users\ -m\ 775 INSTALL_INFO= MAKEINFO=/scratch/work/sysutils/u-boot-pinecube/work/.tools/bin/makeinfo FLEX=/scratch/work/sysutils/u-boot-pinecube/work/.tools/bin/flex BISON=/scratch/work/sysutils/u-boot-pinecube/work/.tools/bin/bison ITSTOOL=/scratch/work/sysutils/u-boot-pinecube/work/.tools/bin/itstool GDBUS_CODEGEN=/scratch/work/sysutils/u-boot-pinecube/work/.tools/bin/gdbus-codegen PKG_CONFIG=/scratch/work/sysutils/u-boot-pinecube/work/.tools/bin/pkg-config PKG_CONFIG_LIBDIR=/scratch/work/sysutils/u-boot-pinecube/work/.buildlink/lib/pkgconfig:/scratch/work/sysutils/u-boot-pinecube/work/.buildlink/share/pkgconfig PKG_CONFIG_LOG=/scratch/work/sysutils/u-boot-pinecube/work/.pkg-config.log PKG_CONFIG_PATH= CWRAPPERS_CONFIG_DIR=/scratch/work/sysutils/u-boot-pinecube/work/.cwrapper/config /usr/pkg/bin/gmake -j2 all
scripts/kconfig/conf  --syncconfig Kconfig
  UPD     include/config.h
  CFG     u-boot.cfg
  GEN     include/autoconf.mk.dep
  CFG     spl/u-boot.cfg
  GEN     include/autoconf.mk
  GEN     spl/include/autoconf.mk
  UPD     include/generated/timestamp_autogenerated.h
  UPD     include/generated/dt.h
git: not found
git: not found
svn: not found
  UPD     include/config/uboot.release
  ENVC    include/generated/env.txt
  ENVP    include/generated/env.in
  UPD     include/generated/version_autogenerated.h
  ENVT    include/generated/environment.h
  SHIPPED scripts/dtc/pylibfdt/libfdt.i
  PYMOD   rebuild
  HOSTCC  scripts/dtc/dtc.o
  HOSTCC  scripts/dtc/flattree.o
/usr/pkg/lib/python3.10/site-packages/setuptools/dist.py:543: UserWarning: The version specified ('u-boot-2022.04') is an invalid version, this may not work as expected with newer versions of setuptools, pip, and PyPI. Please see PEP 440 for more details.
  warnings.warn(
  CFGCHK  u-boot.cfg
  OFCHK   .config
  HOSTCC  scripts/dtc/fstree.o
  CC      lib/asm-offsets.s
  CC      arch/arm/lib/asm-offsets.s
  UPD     include/generated/generic-asm-offsets.h
  UPD     include/generated/asm-offsets.h
  HOSTCC  scripts/dtc/data.o
  LDS     u-boot.lds
  HOSTCC  scripts/dtc/livetree.o
  HOSTCC  scripts/dtc/treesource.o
  HOSTCC  scripts/dtc/srcpos.o
  HOSTCC  scripts/dtc/checks.o
  HOSTCC  scripts/dtc/util.o
  LEX     scripts/dtc/dtc-lexer.lex.c
  YACC    scripts/dtc/dtc-parser.tab.h
  YACC    scripts/dtc/dtc-parser.tab.c
  HOSTCC  scripts/dtc/dtc-lexer.lex.o
  HOSTCC  scripts/dtc/dtc-parser.tab.o
  HOSTLD  scripts/dtc/dtc
  HOSTCC  tools/envcrc.o
  WRAP    tools/lib/crc32.c
tools/Makefile:261: warning: pattern recipe did not update peer target 'tools/common/crc32.c'.
tools/Makefile:261: warning: pattern recipe did not update peer target 'tools/boot/crc32.c'.
  WRAP    tools/env/embedded.c
tools/Makefile:261: warning: pattern recipe did not update peer target 'tools/lib/embedded.c'.
tools/Makefile:261: warning: pattern recipe did not update peer target 'tools/common/embedded.c'.
tools/Makefile:261: warning: pattern recipe did not update peer target 'tools/boot/embedded.c'.
  WRAP    tools/lib/sha1.c
tools/Makefile:261: warning: pattern recipe did not update peer target 'tools/env/sha1.c'.
tools/Makefile:261: warning: pattern recipe did not update peer target 'tools/common/sha1.c'.
tools/Makefile:261: warning: pattern recipe did not update peer target 'tools/boot/sha1.c'.
  HOSTCC  tools/gen_eth_addr
  HOSTCC  tools/gen_ethaddr_crc.o
  WRAP    tools/lib/crc8.c
tools/Makefile:261: warning: pattern recipe did not update peer target 'tools/env/crc8.c'.
tools/Makefile:261: warning: pattern recipe did not update peer target 'tools/common/crc8.c'.
tools/Makefile:261: warning: pattern recipe did not update peer target 'tools/boot/crc8.c'.
  HOSTCC  tools/img2srec
  HOSTCC  tools/mkenvimage.o
  HOSTCC  tools/os_support.o
  HOSTCC  tools/lib/crc32.o
  HOSTCC  tools/aisimage.o
  HOSTCC  tools/atmelimage.o
  HOSTCC  tools/fit_common.o
  HOSTCC  tools/fit_image.o
  HOSTCC  tools/image-host.o
  WRAP    tools/boot/image-fit.c
tools/Makefile:261: warning: pattern recipe did not update peer target 'tools/lib/image-fit.c'.
tools/Makefile:261: warning: pattern recipe did not update peer target 'tools/env/image-fit.c'.
tools/Makefile:261: warning: pattern recipe did not update peer target 'tools/common/image-fit.c'.
  HOSTCC  tools/image-sig-host.o
  WRAP    tools/boot/image-fit-sig.c
tools/Makefile:261: warning: pattern recipe did not update peer target 'tools/lib/image-fit-sig.c'.
tools/Makefile:261: warning: pattern recipe did not update peer target 'tools/env/image-fit-sig.c'.
tools/Makefile:261: warning: pattern recipe did not update peer target 'tools/common/image-fit-sig.c'.
  WRAP    tools/boot/image-cipher.c
tools/Makefile:261: warning: pattern recipe did not update peer target 'tools/lib/image-cipher.c'.
tools/Makefile:261: warning: pattern recipe did not update peer target 'tools/env/image-cipher.c'.
tools/Makefile:261: warning: pattern recipe did not update peer target 'tools/common/image-cipher.c'.
  WRAP    tools/boot/fdt_region.c
tools/Makefile:261: warning: pattern recipe did not update peer target 'tools/lib/fdt_region.c'.
tools/Makefile:261: warning: pattern recipe did not update peer target 'tools/env/fdt_region.c'.
tools/Makefile:261: warning: pattern recipe did not update peer target 'tools/common/fdt_region.c'.
  WRAP    tools/boot/bootm.c
tools/Makefile:261: warning: pattern recipe did not update peer target 'tools/lib/bootm.c'.
tools/Makefile:261: warning: pattern recipe did not update peer target 'tools/env/bootm.c'.
tools/Makefile:261: warning: pattern recipe did not update peer target 'tools/common/bootm.c'.
  HOSTCC  tools/default_image.o
  WRAP    tools/lib/fdtdec_common.c
tools/Makefile:261: warning: pattern recipe did not update peer target 'tools/env/fdtdec_common.c'.
tools/Makefile:261: warning: pattern recipe did not update peer target 'tools/common/fdtdec_common.c'.
tools/Makefile:261: warning: pattern recipe did not update peer target 'tools/boot/fdtdec_common.c'.
  WRAP    tools/lib/fdtdec.c
tools/Makefile:261: warning: pattern recipe did not update peer target 'tools/env/fdtdec.c'.
tools/Makefile:261: warning: pattern recipe did not update peer target 'tools/common/fdtdec.c'.
tools/Makefile:261: warning: pattern recipe did not update peer target 'tools/boot/fdtdec.c'.
  WRAP    tools/boot/image.c
tools/Makefile:261: warning: pattern recipe did not update peer target 'tools/lib/image.c'.
tools/Makefile:261: warning: pattern recipe did not update peer target 'tools/env/image.c'.
tools/Makefile:261: warning: pattern recipe did not update peer target 'tools/common/image.c'.
  WRAP    tools/boot/image-host.c
tools/Makefile:261: warning: pattern recipe did not update peer target 'tools/lib/image-host.c'.
tools/Makefile:261: warning: pattern recipe did not update peer target 'tools/env/image-host.c'.
tools/Makefile:261: warning: pattern recipe did not update peer target 'tools/common/image-host.c'.
  HOSTCC  tools/imagetool.o
  HOSTCC  tools/imximage.o
  HOSTCC  tools/imx8image.o
  HOSTCC  tools/imx8mimage.o
  HOSTCC  tools/kwbimage.o
In file included from tools/kwbimage.c:20:0:
tools/kwbimage.h:15:0: warning: "__packed" redefined
 #define __packed __attribute((packed))
 ^
In file included from /usr/include/stddef.h:37:0,
                 from ././include/compiler.h:8,
                 from <command-line>:0:
/usr/include/sys/cdefs.h:382:0: note: this is the location of the previous definition
 #define __packed __attribute__((__packed__))
 ^
tools/kwbimage.c:30:13: error: redefinition of 'RSA_get0_key'
 static void RSA_get0_key(const RSA *r,
             ^
In file included from tools/kwbimage.c:23:0:
/usr/include/openssl/rsa.h:759:20: note: previous definition of 'RSA_get0_key' was here
 static inline void RSA_get0_key(const RSA *r,
                    ^
gmake[1]: *** [scripts/Makefile.host:112: tools/kwbimage.o] Error 1
gmake[1]: *** Waiting for unfinished jobs....
gmake: *** [Makefile:1894: tools] Error 2
*** Error code 2

Stop.
make[1]: stopped in /tree/pkgsrc/sysutils/u-boot-pinecube
*** Error code 1

Stop.
make: stopped in /tree/pkgsrc/sysutils/u-boot-pinecube