=> Bootstrap dependency digest>=20211023: found digest-20220214
===> Skipping vulnerability checks.
WARNING: No /usr/pkg/pkgdb/pkg-vulnerabilities file found.
WARNING: To fix run: `/usr/sbin/pkg_admin -K /usr/pkg/pkgdb fetch-pkg-vulnerabilities'.
===> Building for shod-2.5.0
--- shod.o ---
--- config.o ---
--- shod.o ---
gcc -I/usr/pkg/include -I/usr/X11R7/include -I/usr/include/freetype2 -I/usr/X11R7/include/freetype2 -O2 -fPIC -D_FORTIFY_SOURCE=2 -I/usr/pkg/include -I/usr/X11R7/include -I/usr/pkg/include -I/usr/X11R7/include -c shod.c
--- config.o ---
gcc -I/usr/pkg/include -I/usr/X11R7/include -I/usr/include/freetype2 -I/usr/X11R7/include/freetype2 -O2 -fPIC -D_FORTIFY_SOURCE=2 -I/usr/pkg/include -I/usr/X11R7/include -I/usr/pkg/include -I/usr/X11R7/include -c config.c
In file included from xutil.h:8:0,
                 from shod.h:3,
                 from config.c:1:
/work/wm/shod/work/.buildlink/include/X11/Xft/Xft.h:39:22: fatal error: ft2build.h: No such file or directory
compilation terminated.
*** [config.o] Error code 1

make: stopped in /work/wm/shod/work/shod-2.5.0
--- shod.o ---
In file included from xutil.h:8:0,
                 from shod.h:3,
                 from shod.c:12:
/work/wm/shod/work/.buildlink/include/X11/Xft/Xft.h:39:22: fatal error: ft2build.h: No such file or directory
compilation terminated.
*** [shod.o] Error code 1

make: stopped in /work/wm/shod/work/shod-2.5.0
2 errors

make: stopped in /work/wm/shod/work/shod-2.5.0
*** Error code 2

Stop.
make[1]: stopped in /tree/pkgsrc/wm/shod
*** Error code 1

Stop.
make: stopped in /tree/pkgsrc/wm/shod