=> Bootstrap dependency digest>=20211023: found digest-20220214
===> Skipping vulnerability checks.
WARNING: No /usr/pkg/pkgdb/pkg-vulnerabilities file found.
WARNING: To fix run: `/usr/sbin/pkg_admin -K /usr/pkg/pkgdb fetch-pkg-vulnerabilities'.
===> Building for gnustep-objc-1.8.1
GNUmakefile:23: GNUstep found - building for install in the GNUstep filesystem.
GNUmakefile:80: warning: overriding recipe for target 'install'
Makefile:129: warning: ignoring old recipe for target 'install'
[  1%] Building CXX object CMakeFiles/objcxx.dir/objcxx_eh.cc.o
[  2%] Building C object CMakeFiles/objc.dir/abi_version.c.o
[  3%] Building C object CMakeFiles/objc.dir/alias_table.c.o
[  4%] Linking C shared library libobjcxx.so
[  5%] Built target objcxx
[  5%] Building C object CMakeFiles/objc.dir/block_to_imp.c.o
[  6%] Building C object CMakeFiles/objc.dir/caps.c.o
/work/devel/gnustep-objc/work/libobjc2-1.8.1/block_to_imp.c:51:10: warning: call to undeclared function 'asprintf'; ISO C99 and later do not support implicit function declarations [-Wimplicit-function-declaration]
        if (0 > asprintf(&tmpPattern, "%s/objc_trampolinesXXXXXXXXXXX", tmp))
                ^
/work/devel/gnustep-objc/work/libobjc2-1.8.1/block_to_imp.c:59:19: warning: passing 'const char *' to parameter of type 'char *' discards qualifiers [-Wincompatible-pointer-types-discards-qualifiers]
        int fd = mkstemp(pattern);
                         ^~~~~~~
/usr/include/stdlib.h:194:20: note: passing argument to parameter here
int      mkstemp(char *);
                       ^
/work/devel/gnustep-objc/work/libobjc2-1.8.1/block_to_imp.c:61:7: warning: passing 'const char *' to parameter of type 'void *' discards qualifiers [-Wincompatible-pointer-types-discards-qualifiers]
        free(pattern);
             ^~~~~~~
/usr/include/stdlib.h:112:18: note: passing argument to parameter here
void     free(void *);
                    ^
[  6%] Building C object CMakeFiles/objc.dir/category_loader.c.o
3 warnings generated.
[  7%] Building C object CMakeFiles/objc.dir/class_table.c.o
[  8%] Building C object CMakeFiles/objc.dir/dtable.c.o
[ 10%] Building C object CMakeFiles/objc.dir/eh_personality.c.o
[ 10%] Building C object CMakeFiles/objc.dir/encoding2.c.o
[ 11%] Building C object CMakeFiles/objc.dir/hash_table.c.o
[ 11%] Building C object CMakeFiles/objc.dir/hooks.c.o
[ 12%] Building C object CMakeFiles/objc.dir/ivar.c.o
[ 13%] Building C object CMakeFiles/objc.dir/legacy_malloc.c.o
[ 14%] Building C object CMakeFiles/objc.dir/loader.c.o
[ 15%] Building C object CMakeFiles/objc.dir/mutation.m.o
[ 15%] Building C object CMakeFiles/objc.dir/protocol.c.o
[ 16%] Building C object CMakeFiles/objc.dir/runtime.c.o
[ 17%] Building C object CMakeFiles/objc.dir/sarray2.c.o
[ 18%] Building C object CMakeFiles/objc.dir/selector_table.c.o
[ 19%] Building C object CMakeFiles/objc.dir/sendmsg2.c.o
[ 20%] Building C object CMakeFiles/objc.dir/statics_loader.c.o
[ 20%] Building C object CMakeFiles/objc.dir/toydispatch.c.o
[ 21%] Building ASM object CMakeFiles/objc.dir/block_trampolines.S.o
[ 22%] Building ASM object CMakeFiles/objc.dir/objc_msgSend.S.o
[ 23%] Building C object CMakeFiles/objc.dir/NSBlocks.m.o
[ 24%] Building C object CMakeFiles/objc.dir/Protocol2.m.o
[ 24%] Building C object CMakeFiles/objc.dir/arc.m.o
[ 25%] Building C object CMakeFiles/objc.dir/associate.m.o
[ 26%] Building C object CMakeFiles/objc.dir/blocks_runtime.m.o
[ 27%] Building C object CMakeFiles/objc.dir/properties.m.o
[ 28%] Building C object CMakeFiles/objc.dir/gc_none.c.o
[ 29%] Linking C shared library libobjc.so
[ 29%] Built target objc
[ 30%] Building C object Test/CMakeFiles/AllocatePair_optimised.dir/AllocatePair.m.o
[ 30%] Building C object Test/CMakeFiles/AllocatePair.dir/AllocatePair.m.o
[ 31%] Linking C executable AllocatePair
[ 32%] Linking C executable AllocatePair_optimised
/usr/bin/ld: ../libobjc.so.4.6: undefined reference to `_Unwind_GetDataRelBase'
/usr/bin/ld: ../libobjc.so.4.6: undefined reference to `_Unwind_SetGR'
/usr/bin/ld: ../libobjc.so.4.6: undefined reference to `_Unwind_GetLanguageSpecificData'
/usr/bin/ld: ../libobjc.so.4.6: undefined reference to `__gcc_personality_v0'
/usr/bin/ld: ../libobjc.so.4.6: undefined reference to `_Unwind_Resume_or_Rethrow'
/usr/bin/ld: ../libobjc.so.4.6: undefined reference to `_Unwind_RaiseException'
/usr/bin/ld: ../libobjc.so.4.6: undefined reference to `_Unwind_SetIP'
/usr/bin/ld: ../libobjc.so.4.6: undefined reference to `_Unwind_GetRegionStart'
/usr/bin/ld: ../libobjc.so.4.6: undefined reference to `_Unwind_GetTextRelBase'
/usr/bin/ld: ../libobjc.so.4.6: undefined reference to `_Unwind_Resume'
/usr/bin/ld: ../libobjc.so.4.6: undefined reference to `_Unwind_GetIP'
clang-15: error: linker command failed with exit code 1 (use -v to see invocation)
gmake[2]: *** [Test/CMakeFiles/AllocatePair.dir/build.make:98: Test/AllocatePair] Error 1
gmake[1]: *** [CMakeFiles/Makefile2:340: Test/CMakeFiles/AllocatePair.dir/all] Error 2
gmake[1]: *** Waiting for unfinished jobs....
/usr/bin/ld: ../libobjc.so.4.6: undefined reference to `_Unwind_GetDataRelBase'
/usr/bin/ld: ../libobjc.so.4.6: undefined reference to `_Unwind_SetGR'
/usr/bin/ld: ../libobjc.so.4.6: undefined reference to `_Unwind_GetLanguageSpecificData'
/usr/bin/ld: ../libobjc.so.4.6: undefined reference to `__gcc_personality_v0'
/usr/bin/ld: ../libobjc.so.4.6: undefined reference to `_Unwind_Resume_or_Rethrow'
/usr/bin/ld: ../libobjc.so.4.6: undefined reference to `_Unwind_RaiseException'
/usr/bin/ld: ../libobjc.so.4.6: undefined reference to `_Unwind_SetIP'
/usr/bin/ld: ../libobjc.so.4.6: undefined reference to `_Unwind_GetRegionStart'
/usr/bin/ld: ../libobjc.so.4.6: undefined reference to `_Unwind_GetTextRelBase'
/usr/bin/ld: ../libobjc.so.4.6: undefined reference to `_Unwind_Resume'
/usr/bin/ld: ../libobjc.so.4.6: undefined reference to `_Unwind_GetIP'
clang-15: error: linker command failed with exit code 1 (use -v to see invocation)
gmake[2]: *** [Test/CMakeFiles/AllocatePair_optimised.dir/build.make:98: Test/AllocatePair_optimised] Error 1
gmake[1]: *** [CMakeFiles/Makefile2:366: Test/CMakeFiles/AllocatePair_optimised.dir/all] Error 2
gmake: *** [Makefile:166: all] Error 2
*** Error code 2

Stop.
make[1]: stopped in /tree/pkgsrc/devel/gnustep-objc
*** Error code 1

Stop.
make: stopped in /tree/pkgsrc/devel/gnustep-objc