=> Bootstrap dependency digest>=20211023: found digest-20220214
===> Skipping vulnerability checks.
WARNING: No /usr/pkg/pkgdb/pkg-vulnerabilities file found.
WARNING: To fix run: `/usr/sbin/pkg_admin -K /usr/pkg/pkgdb fetch-pkg-vulnerabilities'.
===> Building for OVMF-0.0.20181116nb4
cd /scratch/work/sysutils/ovmf/work/edk2-20181116/OvmfPkg &&  /usr/bin/env USETOOLS=no PTHREAD_CFLAGS=\ -pthread\  PTHREAD_LDFLAGS=\ -pthread PTHREAD_LIBS= PTHREADBASE=/usr DL_CFLAGS=\ -pthread\  DL_LDFLAGS=\ -pthread DL_LIBS= PYTHON=/usr/pkg/bin/python2.7 CC=gcc CFLAGS=-O2\ -I/usr/include\ -I/usr/pkg/include CPPFLAGS=-I/usr/include\ -I/usr/pkg/include CXX=c++ CXXFLAGS=-O2\ -I/usr/include\ -I/usr/pkg/include COMPILER_RPATH_FLAG=-Wl,-R F77=gfortran FC=gfortran FFLAGS=-O LANG=C LC_ALL=C LC_COLLATE=C LC_CTYPE=C LC_MESSAGES=C LC_MONETARY=C LC_NUMERIC=C LC_TIME=C LDFLAGS=-Wl,-zrelro\ -L/usr/lib\ -Wl,-R/usr/lib\ -L/usr/pkg/lib\ -Wl,-R/usr/pkg/lib LINKER_RPATH_FLAG=-R PATH=/scratch/work/sysutils/ovmf/work/.cwrapper/bin:/scratch/work/sysutils/ovmf/work/.buildlink/bin:/scratch/work/sysutils/ovmf/work/.gcc/bin:/scratch/work/sysutils/ovmf/work/.tools/bin:/usr/pkg/bin:/sbin:/bin:/usr/sbin:/usr/bin:/usr/pkg/bin:/usr/X11R7/bin PREFIX=/usr/pkg MAKELEVEL=0 CONFIG_SITE= PKG_SYSCONFDIR=/usr/pkg/etc HOME=/scratch/work/sysutils/ovmf/work/.home CWRAPPERS_CONFIG_DIR=/scratch/work/sysutils/ovmf/work/.cwrapper/config CPP=cpp LOCALBASE=/usr/pkg X11BASE=/usr/X11R7 PKGMANDIR=man PKGINFODIR=info PKGGNUDIR=gnu/ MAKECONF=/dev/null OBJECT_FMT=ELF USETOOLS=no BSD_INSTALL_PROGRAM=/usr/bin/install\ -c\ -s\ -o\ pbulk\ -g\ users\ -m\ 755 BSD_INSTALL_SCRIPT=/usr/bin/install\ -c\ -o\ pbulk\ -g\ users\ -m\ 755 BSD_INSTALL_LIB=/usr/bin/install\ -c\ -o\ pbulk\ -g\ users\ -m\ 755 BSD_INSTALL_DATA=/usr/bin/install\ -c\ -o\ pbulk\ -g\ users\ -m\ 644 BSD_INSTALL_MAN=/usr/bin/install\ -c\ -o\ pbulk\ -g\ users\ -m\ 644 BSD_INSTALL=/usr/bin/install BSD_INSTALL_PROGRAM_DIR=/usr/bin/install\ -d\ -o\ pbulk\ -g\ users\ -m\ 755 BSD_INSTALL_SCRIPT_DIR=/usr/bin/install\ -d\ -o\ pbulk\ -g\ users\ -m\ 755 BSD_INSTALL_LIB_DIR=/usr/bin/install\ -d\ -o\ pbulk\ -g\ users\ -m\ 755 BSD_INSTALL_DATA_DIR=/usr/bin/install\ -d\ -o\ pbulk\ -g\ users\ -m\ 755 BSD_INSTALL_MAN_DIR=/usr/bin/install\ -d\ -o\ pbulk\ -g\ users\ -m\ 755 BSD_INSTALL_GAME=/usr/bin/install\ -c\ -s\ -o\ pbulk\ -g\ users\ -m\ 2555 BSD_INSTALL_GAME_DATA=/usr/bin/install\ -c\ -o\ pbulk\ -g\ users\ -m\ 664 BSD_INSTALL_GAME_DIR=/usr/bin/install\ -d\ -o\ pbulk\ -g\ users\ -m\ 775 INSTALL_INFO= MAKEINFO=/scratch/work/sysutils/ovmf/work/.tools/bin/makeinfo FLEX= BISON= ITSTOOL=/scratch/work/sysutils/ovmf/work/.tools/bin/itstool GDBUS_CODEGEN=/scratch/work/sysutils/ovmf/work/.tools/bin/gdbus-codegen PKG_CONFIG=/scratch/work/sysutils/ovmf/work/.tools/bin/pkg-config PKG_CONFIG_LIBDIR=/scratch/work/sysutils/ovmf/work/.buildlink/lib/pkgconfig:/scratch/work/sysutils/ovmf/work/.buildlink/share/pkgconfig PKG_CONFIG_LOG=/scratch/work/sysutils/ovmf/work/.pkg-config.log PKG_CONFIG_PATH= CWRAPPERS_CONFIG_DIR=/scratch/work/sysutils/ovmf/work/.cwrapper/config ./build.sh -a IA32
Initializing workspace
/scratch/work/sysutils/ovmf/work/edk2-20181116/BaseTools
WORKSPACE: /scratch/work/sysutils/ovmf/work/edk2-20181116
EDK_TOOLS_PATH: /scratch/work/sysutils/ovmf/work/edk2-20181116/BaseTools
CONF_PATH: /scratch/work/sysutils/ovmf/work/edk2-20181116/Conf
Copying $EDK_TOOLS_PATH/Conf/build_rule.template
     to /scratch/work/sysutils/ovmf/work/edk2-20181116/Conf/build_rule.txt
Copying $EDK_TOOLS_PATH/Conf/tools_def.template
     to /scratch/work/sysutils/ovmf/work/edk2-20181116/Conf/tools_def.txt
Copying $EDK_TOOLS_PATH/Conf/target.template
     to /scratch/work/sysutils/ovmf/work/edk2-20181116/Conf/target.txt
Building tools no /scratch/work/sysutils/ovmf/work/edk2-20181116/BaseTools/Source/C/bin directory
gmake: Entering directory '/scratch/work/sysutils/ovmf/work/edk2-20181116/BaseTools'
gmake -C Source/C
gmake[1]: Entering directory '/scratch/work/sysutils/ovmf/work/edk2-20181116/BaseTools/Source/C'
Attempting to detect HOST_ARCH from 'uname -m': i386
Detected HOST_ARCH of IA32 using uname.
mkdir -p .
mkdir ./libs 
gmake -C Common
gmake[2]: Entering directory '/scratch/work/sysutils/ovmf/work/edk2-20181116/BaseTools/Source/C/Common'
gcc  -c  -I .. -I ../Include/Common -I ../Include/ -I ../Include/IndustryStandard -I ../Common/ -I .. -I . -I ../Include/Ia32/  -MD -fshort-wchar -fno-strict-aliasing -Wall -Werror -Wno-deprecated-declarations -Wno-stringop-truncation -Wno-restrict -Wno-unused-result -nostdlib -g -O2  BasePeCoff.c -o BasePeCoff.o
gcc  -c  -I .. -I ../Include/Common -I ../Include/ -I ../Include/IndustryStandard -I ../Common/ -I .. -I . -I ../Include/Ia32/  -MD -fshort-wchar -fno-strict-aliasing -Wall -Werror -Wno-deprecated-declarations -Wno-stringop-truncation -Wno-restrict -Wno-unused-result -nostdlib -g -O2  BinderFuncs.c -o BinderFuncs.o
gcc  -c  -I .. -I ../Include/Common -I ../Include/ -I ../Include/IndustryStandard -I ../Common/ -I .. -I . -I ../Include/Ia32/  -MD -fshort-wchar -fno-strict-aliasing -Wall -Werror -Wno-deprecated-declarations -Wno-stringop-truncation -Wno-restrict -Wno-unused-result -nostdlib -g -O2  CommonLib.c -o CommonLib.o
gcc  -c  -I .. -I ../Include/Common -I ../Include/ -I ../Include/IndustryStandard -I ../Common/ -I .. -I . -I ../Include/Ia32/  -MD -fshort-wchar -fno-strict-aliasing -Wall -Werror -Wno-deprecated-declarations -Wno-stringop-truncation -Wno-restrict -Wno-unused-result -nostdlib -g -O2  Crc32.c -o Crc32.o
gcc  -c  -I .. -I ../Include/Common -I ../Include/ -I ../Include/IndustryStandard -I ../Common/ -I .. -I . -I ../Include/Ia32/  -MD -fshort-wchar -fno-strict-aliasing -Wall -Werror -Wno-deprecated-declarations -Wno-stringop-truncation -Wno-restrict -Wno-unused-result -nostdlib -g -O2  Decompress.c -o Decompress.o
gcc  -c  -I .. -I ../Include/Common -I ../Include/ -I ../Include/IndustryStandard -I ../Common/ -I .. -I . -I ../Include/Ia32/  -MD -fshort-wchar -fno-strict-aliasing -Wall -Werror -Wno-deprecated-declarations -Wno-stringop-truncation -Wno-restrict -Wno-unused-result -nostdlib -g -O2  EfiCompress.c -o EfiCompress.o
gcc  -c  -I .. -I ../Include/Common -I ../Include/ -I ../Include/IndustryStandard -I ../Common/ -I .. -I . -I ../Include/Ia32/  -MD -fshort-wchar -fno-strict-aliasing -Wall -Werror -Wno-deprecated-declarations -Wno-stringop-truncation -Wno-restrict -Wno-unused-result -nostdlib -g -O2  EfiUtilityMsgs.c -o EfiUtilityMsgs.o
gcc  -c  -I .. -I ../Include/Common -I ../Include/ -I ../Include/IndustryStandard -I ../Common/ -I .. -I . -I ../Include/Ia32/  -MD -fshort-wchar -fno-strict-aliasing -Wall -Werror -Wno-deprecated-declarations -Wno-stringop-truncation -Wno-restrict -Wno-unused-result -nostdlib -g -O2  FirmwareVolumeBuffer.c -o FirmwareVolumeBuffer.o
gcc  -c  -I .. -I ../Include/Common -I ../Include/ -I ../Include/IndustryStandard -I ../Common/ -I .. -I . -I ../Include/Ia32/  -MD -fshort-wchar -fno-strict-aliasing -Wall -Werror -Wno-deprecated-declarations -Wno-stringop-truncation -Wno-restrict -Wno-unused-result -nostdlib -g -O2  FvLib.c -o FvLib.o
gcc  -c  -I .. -I ../Include/Common -I ../Include/ -I ../Include/IndustryStandard -I ../Common/ -I .. -I . -I ../Include/Ia32/  -MD -fshort-wchar -fno-strict-aliasing -Wall -Werror -Wno-deprecated-declarations -Wno-stringop-truncation -Wno-restrict -Wno-unused-result -nostdlib -g -O2  MemoryFile.c -o MemoryFile.o
gcc  -c  -I .. -I ../Include/Common -I ../Include/ -I ../Include/IndustryStandard -I ../Common/ -I .. -I . -I ../Include/Ia32/  -MD -fshort-wchar -fno-strict-aliasing -Wall -Werror -Wno-deprecated-declarations -Wno-stringop-truncation -Wno-restrict -Wno-unused-result -nostdlib -g -O2  MyAlloc.c -o MyAlloc.o
gcc  -c  -I .. -I ../Include/Common -I ../Include/ -I ../Include/IndustryStandard -I ../Common/ -I .. -I . -I ../Include/Ia32/  -MD -fshort-wchar -fno-strict-aliasing -Wall -Werror -Wno-deprecated-declarations -Wno-stringop-truncation -Wno-restrict -Wno-unused-result -nostdlib -g -O2  OsPath.c -o OsPath.o
gcc  -c  -I .. -I ../Include/Common -I ../Include/ -I ../Include/IndustryStandard -I ../Common/ -I .. -I . -I ../Include/Ia32/  -MD -fshort-wchar -fno-strict-aliasing -Wall -Werror -Wno-deprecated-declarations -Wno-stringop-truncation -Wno-restrict -Wno-unused-result -nostdlib -g -O2  ParseGuidedSectionTools.c -o ParseGuidedSectionTools.o
gcc  -c  -I .. -I ../Include/Common -I ../Include/ -I ../Include/IndustryStandard -I ../Common/ -I .. -I . -I ../Include/Ia32/  -MD -fshort-wchar -fno-strict-aliasing -Wall -Werror -Wno-deprecated-declarations -Wno-stringop-truncation -Wno-restrict -Wno-unused-result -nostdlib -g -O2  ParseInf.c -o ParseInf.o
gcc  -c  -I .. -I ../Include/Common -I ../Include/ -I ../Include/IndustryStandard -I ../Common/ -I .. -I . -I ../Include/Ia32/  -MD -fshort-wchar -fno-strict-aliasing -Wall -Werror -Wno-deprecated-declarations -Wno-stringop-truncation -Wno-restrict -Wno-unused-result -nostdlib -g -O2  PeCoffLoaderEx.c -o PeCoffLoaderEx.o
gcc  -c  -I .. -I ../Include/Common -I ../Include/ -I ../Include/IndustryStandard -I ../Common/ -I .. -I . -I ../Include/Ia32/  -MD -fshort-wchar -fno-strict-aliasing -Wall -Werror -Wno-deprecated-declarations -Wno-stringop-truncation -Wno-restrict -Wno-unused-result -nostdlib -g -O2  SimpleFileParsing.c -o SimpleFileParsing.o
gcc  -c  -I .. -I ../Include/Common -I ../Include/ -I ../Include/IndustryStandard -I ../Common/ -I .. -I . -I ../Include/Ia32/  -MD -fshort-wchar -fno-strict-aliasing -Wall -Werror -Wno-deprecated-declarations -Wno-stringop-truncation -Wno-restrict -Wno-unused-result -nostdlib -g -O2  StringFuncs.c -o StringFuncs.o
gcc  -c  -I .. -I ../Include/Common -I ../Include/ -I ../Include/IndustryStandard -I ../Common/ -I .. -I . -I ../Include/Ia32/  -MD -fshort-wchar -fno-strict-aliasing -Wall -Werror -Wno-deprecated-declarations -Wno-stringop-truncation -Wno-restrict -Wno-unused-result -nostdlib -g -O2  TianoCompress.c -o TianoCompress.o
gcc  -c  -I .. -I ../Include/Common -I ../Include/ -I ../Include/IndustryStandard -I ../Common/ -I .. -I . -I ../Include/Ia32/  -MD -fshort-wchar -fno-strict-aliasing -Wall -Werror -Wno-deprecated-declarations -Wno-stringop-truncation -Wno-restrict -Wno-unused-result -nostdlib -g -O2  PcdValueCommon.c -o PcdValueCommon.o
ar crs ../libs/libCommon.a BasePeCoff.o BinderFuncs.o CommonLib.o Crc32.o Decompress.o EfiCompress.o EfiUtilityMsgs.o FirmwareVolumeBuffer.o FvLib.o MemoryFile.o MyAlloc.o OsPath.o ParseGuidedSectionTools.o ParseInf.o PeCoffLoaderEx.o SimpleFileParsing.o StringFuncs.o TianoCompress.o PcdValueCommon.o
gmake[2]: Leaving directory '/scratch/work/sysutils/ovmf/work/edk2-20181116/BaseTools/Source/C/Common'
mkdir ./bin
gmake -C VfrCompile VfrLexer.h
gmake[2]: Entering directory '/scratch/work/sysutils/ovmf/work/edk2-20181116/BaseTools/Source/C/VfrCompile'
BIN_DIR='.' gmake -C Pccts/dlg
gmake[3]: Entering directory '/scratch/work/sysutils/ovmf/work/edk2-20181116/BaseTools/Source/C/VfrCompile/Pccts/dlg'
cc -O -I. -I../support/set -I../h -DUSER_ZZSYN -DZZLEXBUFSIZE=65536 -c dlg_p.c
cc -O -I. -I../support/set -I../h -DUSER_ZZSYN -DZZLEXBUFSIZE=65536 -c dlg_a.c
cc -O -I. -I../support/set -I../h -DUSER_ZZSYN -DZZLEXBUFSIZE=65536 -c main.c
cc -c -O -I. -I../support/set -I../h -DUSER_ZZSYN -DZZLEXBUFSIZE=65536  err.c -o err.o
cc -c -O -I. -I../support/set -I../h -DUSER_ZZSYN -DZZLEXBUFSIZE=65536 ../support/set/set.c
cc -c -O -I. -I../support/set -I../h -DUSER_ZZSYN -DZZLEXBUFSIZE=65536  support.c -o support.o
cc -c -O -I. -I../support/set -I../h -DUSER_ZZSYN -DZZLEXBUFSIZE=65536  output.c -o output.o
cc -c -O -I. -I../support/set -I../h -DUSER_ZZSYN -DZZLEXBUFSIZE=65536  relabel.c -o relabel.o
cc -c -O -I. -I../support/set -I../h -DUSER_ZZSYN -DZZLEXBUFSIZE=65536  automata.c -o automata.o
cc -O -I. -I../support/set -I../h -DUSER_ZZSYN -DZZLEXBUFSIZE=65536 -o ./dlg dlg_p.o dlg_a.o main.o err.o set.o support.o output.o relabel.o automata.o
gmake[3]: Leaving directory '/scratch/work/sysutils/ovmf/work/edk2-20181116/BaseTools/Source/C/VfrCompile/Pccts/dlg'
BIN_DIR='.' gmake -C Pccts/antlr
gmake[3]: Entering directory '/scratch/work/sysutils/ovmf/work/edk2-20181116/BaseTools/Source/C/VfrCompile/Pccts/antlr'
gcc -c -O -I. -I../support/set -I../h -DUSER_ZZSYN  -DZZLEXBUFSIZE=65536  antlr.c -o antlr.o
gcc -c -O -I. -I../support/set -I../h -DUSER_ZZSYN  -DZZLEXBUFSIZE=65536  scan.c -o scan.o
gcc -c -O -I. -I../support/set -I../h -DUSER_ZZSYN  -DZZLEXBUFSIZE=65536  err.c -o err.o
gcc -c -O -I. -I../support/set -I../h -DUSER_ZZSYN  -DZZLEXBUFSIZE=65536  bits.c -o bits.o
gcc -c -O -I. -I../support/set -I../h -DUSER_ZZSYN  -DZZLEXBUFSIZE=65536  build.c -o build.o
gcc -c -O -I. -I../support/set -I../h -DUSER_ZZSYN  -DZZLEXBUFSIZE=65536  fset2.c -o fset2.o
gcc -c -O -I. -I../support/set -I../h -DUSER_ZZSYN  -DZZLEXBUFSIZE=65536  fset.c -o fset.o
gcc -c -O -I. -I../support/set -I../h -DUSER_ZZSYN  -DZZLEXBUFSIZE=65536  gen.c -o gen.o
gcc -c -O -I. -I../support/set -I../h -DUSER_ZZSYN  -DZZLEXBUFSIZE=65536  globals.c -o globals.o
gcc -c -O -I. -I../support/set -I../h -DUSER_ZZSYN  -DZZLEXBUFSIZE=65536  hash.c -o hash.o
gcc -c -O -I. -I../support/set -I../h -DUSER_ZZSYN  -DZZLEXBUFSIZE=65536  lex.c -o lex.o
gcc -c -O -I. -I../support/set -I../h -DUSER_ZZSYN  -DZZLEXBUFSIZE=65536  main.c -o main.o
gcc -c -O -I. -I../support/set -I../h -DUSER_ZZSYN  -DZZLEXBUFSIZE=65536  misc.c -o misc.o
gcc -O -I. -I../support/set -I../h -DUSER_ZZSYN  -DZZLEXBUFSIZE=65536 -c -o set.o ../support/set/set.c
gcc -c -O -I. -I../support/set -I../h -DUSER_ZZSYN  -DZZLEXBUFSIZE=65536  pred.c -o pred.o
gcc -c -O -I. -I../support/set -I../h -DUSER_ZZSYN  -DZZLEXBUFSIZE=65536  egman.c -o egman.o
gcc -c -O -I. -I../support/set -I../h -DUSER_ZZSYN  -DZZLEXBUFSIZE=65536  mrhoist.c -o mrhoist.o
gcc -c -O -I. -I../support/set -I../h -DUSER_ZZSYN  -DZZLEXBUFSIZE=65536  fcache.c -o fcache.o
gcc -O -I. -I../support/set -I../h -DUSER_ZZSYN  -DZZLEXBUFSIZE=65536 -o ./antlr antlr.o scan.o err.o bits.o build.o fset2.o fset.o gen.o globals.o hash.o lex.o main.o misc.o set.o pred.o egman.o mrhoist.o fcache.o
gmake[3]: Leaving directory '/scratch/work/sysutils/ovmf/work/edk2-20181116/BaseTools/Source/C/VfrCompile/Pccts/antlr'
Pccts/antlr/antlr -CC -e3 -ck 3 -k 2 -fl VfrParser.dlg -ft VfrTokens.h -o . VfrSyntax.g
Antlr parser generator   Version 1.33MR33   1989-2001
VfrSyntax.g, line 2018: warning: predicate: LT(i) missing, bad, or with i=0; assuming i=1
VfrSyntax.g, line 2023: warning: predicate: LT(i) missing, bad, or with i=0; assuming i=1
VfrSyntax.g, line 3651: warning: alts 1 and 2 of {..} ambiguous upon ( ";" RefreshGuid GuidOp Locked Image EndIf InconsistentIf DisableIf SuppressIf Default GrayOutIf )
VfrSyntax.g, line 3660: warning: alts 1 and 2 of {..} ambiguous upon ( ";" RefreshGuid GuidOp Locked Image EndIf InconsistentIf DisableIf SuppressIf Default GrayOutIf )
VfrSyntax.g, line 3669: warning: alts 1 and 2 of {..} ambiguous upon ( ";" RefreshGuid GuidOp Locked Image EndIf InconsistentIf DisableIf SuppressIf Default GrayOutIf )
VfrSyntax.g, line 3679: warning: alts 1 and 2 of {..} ambiguous upon ( ";" RefreshGuid GuidOp Locked Image EndIf InconsistentIf DisableIf SuppressIf Default GrayOutIf )
VfrSyntax.g, line 3709: warning: alts 1 and 2 of {..} ambiguous upon ( ";" RefreshGuid GuidOp Locked Image EndIf InconsistentIf DisableIf SuppressIf Default GrayOutIf )
VfrSyntax.g, line 3718: warning: alts 1 and 2 of {..} ambiguous upon ( ";" RefreshGuid GuidOp Locked Image EndIf InconsistentIf DisableIf SuppressIf Default GrayOutIf )
Pccts/dlg/dlg -C2 -i -CC -cl VfrLexer -o . VfrParser.dlg
dlg  Version 1.33MR33   1989-2001

gmake[2]: Leaving directory '/scratch/work/sysutils/ovmf/work/edk2-20181116/BaseTools/Source/C/VfrCompile'
gmake -C BrotliCompress
gmake[2]: Entering directory '/scratch/work/sysutils/ovmf/work/edk2-20181116/BaseTools/Source/C/BrotliCompress'
gcc  -c -I ./include -I .. -I ../Include/Common -I ../Include/ -I ../Include/IndustryStandard -I ../Common/ -I .. -I . -I ../Include/Ia32/  -MD -fshort-wchar -fno-strict-aliasing -Wall -Werror -Wno-deprecated-declarations -Wno-stringop-truncation -Wno-restrict -Wno-unused-result -nostdlib -g -O2  tools/brotli.c -o tools/brotli.o
gcc  -c -I ./include -I .. -I ../Include/Common -I ../Include/ -I ../Include/IndustryStandard -I ../Common/ -I .. -I . -I ../Include/Ia32/  -MD -fshort-wchar -fno-strict-aliasing -Wall -Werror -Wno-deprecated-declarations -Wno-stringop-truncation -Wno-restrict -Wno-unused-result -nostdlib -g -O2  common/dictionary.c -o common/dictionary.o
gcc  -c -I ./include -I .. -I ../Include/Common -I ../Include/ -I ../Include/IndustryStandard -I ../Common/ -I .. -I . -I ../Include/Ia32/  -MD -fshort-wchar -fno-strict-aliasing -Wall -Werror -Wno-deprecated-declarations -Wno-stringop-truncation -Wno-restrict -Wno-unused-result -nostdlib -g -O2  common/transform.c -o common/transform.o
gcc  -c -I ./include -I .. -I ../Include/Common -I ../Include/ -I ../Include/IndustryStandard -I ../Common/ -I .. -I . -I ../Include/Ia32/  -MD -fshort-wchar -fno-strict-aliasing -Wall -Werror -Wno-deprecated-declarations -Wno-stringop-truncation -Wno-restrict -Wno-unused-result -nostdlib -g -O2  dec/bit_reader.c -o dec/bit_reader.o
gcc  -c -I ./include -I .. -I ../Include/Common -I ../Include/ -I ../Include/IndustryStandard -I ../Common/ -I .. -I . -I ../Include/Ia32/  -MD -fshort-wchar -fno-strict-aliasing -Wall -Werror -Wno-deprecated-declarations -Wno-stringop-truncation -Wno-restrict -Wno-unused-result -nostdlib -g -O2  dec/decode.c -o dec/decode.o
gcc  -c -I ./include -I .. -I ../Include/Common -I ../Include/ -I ../Include/IndustryStandard -I ../Common/ -I .. -I . -I ../Include/Ia32/  -MD -fshort-wchar -fno-strict-aliasing -Wall -Werror -Wno-deprecated-declarations -Wno-stringop-truncation -Wno-restrict -Wno-unused-result -nostdlib -g -O2  dec/huffman.c -o dec/huffman.o
gcc  -c -I ./include -I .. -I ../Include/Common -I ../Include/ -I ../Include/IndustryStandard -I ../Common/ -I .. -I . -I ../Include/Ia32/  -MD -fshort-wchar -fno-strict-aliasing -Wall -Werror -Wno-deprecated-declarations -Wno-stringop-truncation -Wno-restrict -Wno-unused-result -nostdlib -g -O2  dec/state.c -o dec/state.o
gcc  -c -I ./include -I .. -I ../Include/Common -I ../Include/ -I ../Include/IndustryStandard -I ../Common/ -I .. -I . -I ../Include/Ia32/  -MD -fshort-wchar -fno-strict-aliasing -Wall -Werror -Wno-deprecated-declarations -Wno-stringop-truncation -Wno-restrict -Wno-unused-result -nostdlib -g -O2  enc/backward_references.c -o enc/backward_references.o
gcc  -c -I ./include -I .. -I ../Include/Common -I ../Include/ -I ../Include/IndustryStandard -I ../Common/ -I .. -I . -I ../Include/Ia32/  -MD -fshort-wchar -fno-strict-aliasing -Wall -Werror -Wno-deprecated-declarations -Wno-stringop-truncation -Wno-restrict -Wno-unused-result -nostdlib -g -O2  enc/backward_references_hq.c -o enc/backward_references_hq.o
gcc  -c -I ./include -I .. -I ../Include/Common -I ../Include/ -I ../Include/IndustryStandard -I ../Common/ -I .. -I . -I ../Include/Ia32/  -MD -fshort-wchar -fno-strict-aliasing -Wall -Werror -Wno-deprecated-declarations -Wno-stringop-truncation -Wno-restrict -Wno-unused-result -nostdlib -g -O2  enc/bit_cost.c -o enc/bit_cost.o
gcc  -c -I ./include -I .. -I ../Include/Common -I ../Include/ -I ../Include/IndustryStandard -I ../Common/ -I .. -I . -I ../Include/Ia32/  -MD -fshort-wchar -fno-strict-aliasing -Wall -Werror -Wno-deprecated-declarations -Wno-stringop-truncation -Wno-restrict -Wno-unused-result -nostdlib -g -O2  enc/block_splitter.c -o enc/block_splitter.o
gcc  -c -I ./include -I .. -I ../Include/Common -I ../Include/ -I ../Include/IndustryStandard -I ../Common/ -I .. -I . -I ../Include/Ia32/  -MD -fshort-wchar -fno-strict-aliasing -Wall -Werror -Wno-deprecated-declarations -Wno-stringop-truncation -Wno-restrict -Wno-unused-result -nostdlib -g -O2  enc/brotli_bit_stream.c -o enc/brotli_bit_stream.o
gcc  -c -I ./include -I .. -I ../Include/Common -I ../Include/ -I ../Include/IndustryStandard -I ../Common/ -I .. -I . -I ../Include/Ia32/  -MD -fshort-wchar -fno-strict-aliasing -Wall -Werror -Wno-deprecated-declarations -Wno-stringop-truncation -Wno-restrict -Wno-unused-result -nostdlib -g -O2  enc/cluster.c -o enc/cluster.o
gcc  -c -I ./include -I .. -I ../Include/Common -I ../Include/ -I ../Include/IndustryStandard -I ../Common/ -I .. -I . -I ../Include/Ia32/  -MD -fshort-wchar -fno-strict-aliasing -Wall -Werror -Wno-deprecated-declarations -Wno-stringop-truncation -Wno-restrict -Wno-unused-result -nostdlib -g -O2  enc/compress_fragment.c -o enc/compress_fragment.o
gcc  -c -I ./include -I .. -I ../Include/Common -I ../Include/ -I ../Include/IndustryStandard -I ../Common/ -I .. -I . -I ../Include/Ia32/  -MD -fshort-wchar -fno-strict-aliasing -Wall -Werror -Wno-deprecated-declarations -Wno-stringop-truncation -Wno-restrict -Wno-unused-result -nostdlib -g -O2  enc/compress_fragment_two_pass.c -o enc/compress_fragment_two_pass.o
gcc  -c -I ./include -I .. -I ../Include/Common -I ../Include/ -I ../Include/IndustryStandard -I ../Common/ -I .. -I . -I ../Include/Ia32/  -MD -fshort-wchar -fno-strict-aliasing -Wall -Werror -Wno-deprecated-declarations -Wno-stringop-truncation -Wno-restrict -Wno-unused-result -nostdlib -g -O2  enc/dictionary_hash.c -o enc/dictionary_hash.o
gcc  -c -I ./include -I .. -I ../Include/Common -I ../Include/ -I ../Include/IndustryStandard -I ../Common/ -I .. -I . -I ../Include/Ia32/  -MD -fshort-wchar -fno-strict-aliasing -Wall -Werror -Wno-deprecated-declarations -Wno-stringop-truncation -Wno-restrict -Wno-unused-result -nostdlib -g -O2  enc/encode.c -o enc/encode.o
gcc  -c -I ./include -I .. -I ../Include/Common -I ../Include/ -I ../Include/IndustryStandard -I ../Common/ -I .. -I . -I ../Include/Ia32/  -MD -fshort-wchar -fno-strict-aliasing -Wall -Werror -Wno-deprecated-declarations -Wno-stringop-truncation -Wno-restrict -Wno-unused-result -nostdlib -g -O2  enc/encoder_dict.c -o enc/encoder_dict.o
gcc  -c -I ./include -I .. -I ../Include/Common -I ../Include/ -I ../Include/IndustryStandard -I ../Common/ -I .. -I . -I ../Include/Ia32/  -MD -fshort-wchar -fno-strict-aliasing -Wall -Werror -Wno-deprecated-declarations -Wno-stringop-truncation -Wno-restrict -Wno-unused-result -nostdlib -g -O2  enc/entropy_encode.c -o enc/entropy_encode.o
gcc  -c -I ./include -I .. -I ../Include/Common -I ../Include/ -I ../Include/IndustryStandard -I ../Common/ -I .. -I . -I ../Include/Ia32/  -MD -fshort-wchar -fno-strict-aliasing -Wall -Werror -Wno-deprecated-declarations -Wno-stringop-truncation -Wno-restrict -Wno-unused-result -nostdlib -g -O2  enc/histogram.c -o enc/histogram.o
gcc  -c -I ./include -I .. -I ../Include/Common -I ../Include/ -I ../Include/IndustryStandard -I ../Common/ -I .. -I . -I ../Include/Ia32/  -MD -fshort-wchar -fno-strict-aliasing -Wall -Werror -Wno-deprecated-declarations -Wno-stringop-truncation -Wno-restrict -Wno-unused-result -nostdlib -g -O2  enc/literal_cost.c -o enc/literal_cost.o
gcc  -c -I ./include -I .. -I ../Include/Common -I ../Include/ -I ../Include/IndustryStandard -I ../Common/ -I .. -I . -I ../Include/Ia32/  -MD -fshort-wchar -fno-strict-aliasing -Wall -Werror -Wno-deprecated-declarations -Wno-stringop-truncation -Wno-restrict -Wno-unused-result -nostdlib -g -O2  enc/memory.c -o enc/memory.o
gcc  -c -I ./include -I .. -I ../Include/Common -I ../Include/ -I ../Include/IndustryStandard -I ../Common/ -I .. -I . -I ../Include/Ia32/  -MD -fshort-wchar -fno-strict-aliasing -Wall -Werror -Wno-deprecated-declarations -Wno-stringop-truncation -Wno-restrict -Wno-unused-result -nostdlib -g -O2  enc/metablock.c -o enc/metablock.o
gcc  -c -I ./include -I .. -I ../Include/Common -I ../Include/ -I ../Include/IndustryStandard -I ../Common/ -I .. -I . -I ../Include/Ia32/  -MD -fshort-wchar -fno-strict-aliasing -Wall -Werror -Wno-deprecated-declarations -Wno-stringop-truncation -Wno-restrict -Wno-unused-result -nostdlib -g -O2  enc/static_dict.c -o enc/static_dict.o
gcc  -c -I ./include -I .. -I ../Include/Common -I ../Include/ -I ../Include/IndustryStandard -I ../Common/ -I .. -I . -I ../Include/Ia32/  -MD -fshort-wchar -fno-strict-aliasing -Wall -Werror -Wno-deprecated-declarations -Wno-stringop-truncation -Wno-restrict -Wno-unused-result -nostdlib -g -O2  enc/utf8_util.c -o enc/utf8_util.o
gcc -o ../bin/Brotli  tools/brotli.o common/dictionary.o common/transform.o dec/bit_reader.o dec/decode.o dec/huffman.o dec/state.o enc/backward_references.o enc/backward_references_hq.o enc/bit_cost.o enc/block_splitter.o enc/brotli_bit_stream.o enc/cluster.o enc/compress_fragment.o enc/compress_fragment_two_pass.o enc/dictionary_hash.o enc/encode.o enc/encoder_dict.o enc/entropy_encode.o enc/histogram.o enc/literal_cost.o enc/memory.o enc/metablock.o enc/static_dict.o enc/utf8_util.o -L../libs -lm
gmake[2]: Leaving directory '/scratch/work/sysutils/ovmf/work/edk2-20181116/BaseTools/Source/C/BrotliCompress'
gmake -C VfrCompile
gmake[2]: Entering directory '/scratch/work/sysutils/ovmf/work/edk2-20181116/BaseTools/Source/C/VfrCompile'
g++ -c -DPCCTS_USE_NAMESPACE_STD -I Pccts/h -I .. -I ../Include/Common -I ../Include/ -I ../Include/IndustryStandard -I ../Common/ -I .. -I . -I ../Include/Ia32/   -O2  Pccts/h/AParser.cpp -o AParser.o
g++ -c -DPCCTS_USE_NAMESPACE_STD -I Pccts/h -I .. -I ../Include/Common -I ../Include/ -I ../Include/IndustryStandard -I ../Common/ -I .. -I . -I ../Include/Ia32/   -O2  Pccts/h/DLexerBase.cpp -o DLexerBase.o
g++ -c -DPCCTS_USE_NAMESPACE_STD -I Pccts/h -I .. -I ../Include/Common -I ../Include/ -I ../Include/IndustryStandard -I ../Common/ -I .. -I . -I ../Include/Ia32/   -O2  Pccts/h/ATokenBuffer.cpp -o ATokenBuffer.o
g++ -c -I Pccts/h -I .. -I ../Include/Common -I ../Include/ -I ../Include/IndustryStandard -I ../Common/ -I .. -I . -I ../Include/Ia32/  -Wno-unused-result -O2  EfiVfrParser.cpp -o EfiVfrParser.o
g++ -c -I Pccts/h -I .. -I ../Include/Common -I ../Include/ -I ../Include/IndustryStandard -I ../Common/ -I .. -I . -I ../Include/Ia32/  -Wno-unused-result -O2  VfrLexer.cpp -o VfrLexer.o
g++ -c -DPCCTS_USE_NAMESPACE_STD -I Pccts/h -I .. -I ../Include/Common -I ../Include/ -I ../Include/IndustryStandard -I ../Common/ -I .. -I . -I ../Include/Ia32/   -O2  VfrSyntax.cpp -o VfrSyntax.o
g++ -c -I Pccts/h -I .. -I ../Include/Common -I ../Include/ -I ../Include/IndustryStandard -I ../Common/ -I .. -I . -I ../Include/Ia32/  -Wno-unused-result -O2  VfrFormPkg.cpp -o VfrFormPkg.o
g++ -c -I Pccts/h -I .. -I ../Include/Common -I ../Include/ -I ../Include/IndustryStandard -I ../Common/ -I .. -I . -I ../Include/Ia32/  -Wno-unused-result -O2  VfrError.cpp -o VfrError.o
g++ -c -I Pccts/h -I .. -I ../Include/Common -I ../Include/ -I ../Include/IndustryStandard -I ../Common/ -I .. -I . -I ../Include/Ia32/  -Wno-unused-result -O2  VfrUtilityLib.cpp -o VfrUtilityLib.o
g++ -c -I Pccts/h -I .. -I ../Include/Common -I ../Include/ -I ../Include/IndustryStandard -I ../Common/ -I .. -I . -I ../Include/Ia32/  -Wno-unused-result -O2  VfrCompiler.cpp -o VfrCompiler.o
g++ -o ../bin/VfrCompile  AParser.o DLexerBase.o ATokenBuffer.o EfiVfrParser.o VfrLexer.o VfrSyntax.o VfrFormPkg.o VfrError.o VfrUtilityLib.o VfrCompiler.o -L../libs -lCommon
gmake[2]: Leaving directory '/scratch/work/sysutils/ovmf/work/edk2-20181116/BaseTools/Source/C/VfrCompile'
gmake -C GnuGenBootSector
gmake[2]: Entering directory '/scratch/work/sysutils/ovmf/work/edk2-20181116/BaseTools/Source/C/GnuGenBootSector'
gcc  -c  -I .. -I ../Include/Common -I ../Include/ -I ../Include/IndustryStandard -I ../Common/ -I .. -I . -I ../Include/Ia32/  -MD -fshort-wchar -fno-strict-aliasing -Wall -Werror -Wno-deprecated-declarations -Wno-stringop-truncation -Wno-restrict -Wno-unused-result -nostdlib -g -O2  GnuGenBootSector.c -o GnuGenBootSector.o
gcc -o ../bin/GnuGenBootSector  GnuGenBootSector.o -L../libs -lCommon
gmake[2]: Leaving directory '/scratch/work/sysutils/ovmf/work/edk2-20181116/BaseTools/Source/C/GnuGenBootSector'
gmake -C BootSectImage
gmake[2]: Entering directory '/scratch/work/sysutils/ovmf/work/edk2-20181116/BaseTools/Source/C/BootSectImage'
gcc  -c  -I .. -I ../Include/Common -I ../Include/ -I ../Include/IndustryStandard -I ../Common/ -I .. -I . -I ../Include/Ia32/  -MD -fshort-wchar -fno-strict-aliasing -Wall -Werror -Wno-deprecated-declarations -Wno-stringop-truncation -Wno-restrict -Wno-unused-result -nostdlib -g -O2  bootsectimage.c -o bootsectimage.o
gcc -o ../bin/BootSectImage  bootsectimage.o -L../libs -lCommon
gmake[2]: Leaving directory '/scratch/work/sysutils/ovmf/work/edk2-20181116/BaseTools/Source/C/BootSectImage'
gmake -C EfiLdrImage
gmake[2]: Entering directory '/scratch/work/sysutils/ovmf/work/edk2-20181116/BaseTools/Source/C/EfiLdrImage'
gcc  -c  -I .. -I ../Include/Common -I ../Include/ -I ../Include/IndustryStandard -I ../Common/ -I .. -I . -I ../Include/Ia32/  -MD -fshort-wchar -fno-strict-aliasing -Wall -Werror -Wno-deprecated-declarations -Wno-stringop-truncation -Wno-restrict -Wno-unused-result -nostdlib -g -O2  EfiLdrImage.c -o EfiLdrImage.o
gcc -o ../bin/EfiLdrImage  EfiLdrImage.o -L../libs -lCommon
gmake[2]: Leaving directory '/scratch/work/sysutils/ovmf/work/edk2-20181116/BaseTools/Source/C/EfiLdrImage'
gmake -C EfiRom
gmake[2]: Entering directory '/scratch/work/sysutils/ovmf/work/edk2-20181116/BaseTools/Source/C/EfiRom'
gcc  -c  -I .. -I ../Include/Common -I ../Include/ -I ../Include/IndustryStandard -I ../Common/ -I .. -I . -I ../Include/Ia32/  -MD -fshort-wchar -fno-strict-aliasing -Wall -Werror -Wno-deprecated-declarations -Wno-stringop-truncation -Wno-restrict -Wno-unused-result -nostdlib -g -O2  EfiRom.c -o EfiRom.o
gcc -o ../bin/EfiRom  EfiRom.o -L../libs -lCommon
gmake[2]: Leaving directory '/scratch/work/sysutils/ovmf/work/edk2-20181116/BaseTools/Source/C/EfiRom'
gmake -C GenFfs
gmake[2]: Entering directory '/scratch/work/sysutils/ovmf/work/edk2-20181116/BaseTools/Source/C/GenFfs'
gcc  -c  -I .. -I ../Include/Common -I ../Include/ -I ../Include/IndustryStandard -I ../Common/ -I .. -I . -I ../Include/Ia32/  -MD -fshort-wchar -fno-strict-aliasing -Wall -Werror -Wno-deprecated-declarations -Wno-stringop-truncation -Wno-restrict -Wno-unused-result -nostdlib -g -O2  GenFfs.c -o GenFfs.o
gcc -o ../bin/GenFfs  GenFfs.o -L../libs -lCommon
gmake[2]: Leaving directory '/scratch/work/sysutils/ovmf/work/edk2-20181116/BaseTools/Source/C/GenFfs'
gmake -C GenFv
gmake[2]: Entering directory '/scratch/work/sysutils/ovmf/work/edk2-20181116/BaseTools/Source/C/GenFv'
gcc  -c  -I .. -I ../Include/Common -I ../Include/ -I ../Include/IndustryStandard -I ../Common/ -I .. -I . -I ../Include/Ia32/  -MD -fshort-wchar -fno-strict-aliasing -Wall -Werror -Wno-deprecated-declarations -Wno-stringop-truncation -Wno-restrict -Wno-unused-result -nostdlib -g -O2  GenFv.c -o GenFv.o
gcc  -c  -I .. -I ../Include/Common -I ../Include/ -I ../Include/IndustryStandard -I ../Common/ -I .. -I . -I ../Include/Ia32/  -MD -fshort-wchar -fno-strict-aliasing -Wall -Werror -Wno-deprecated-declarations -Wno-stringop-truncation -Wno-restrict -Wno-unused-result -nostdlib -g -O2  GenFvInternalLib.c -o GenFvInternalLib.o
gcc -o ../bin/GenFv  GenFv.o GenFvInternalLib.o -L../libs -lCommon
gmake[2]: Leaving directory '/scratch/work/sysutils/ovmf/work/edk2-20181116/BaseTools/Source/C/GenFv'
gmake -C GenFw
gmake[2]: Entering directory '/scratch/work/sysutils/ovmf/work/edk2-20181116/BaseTools/Source/C/GenFw'
gcc  -c  -I .. -I ../Include/Common -I ../Include/ -I ../Include/IndustryStandard -I ../Common/ -I .. -I . -I ../Include/Ia32/  -MD -fshort-wchar -fno-strict-aliasing -Wall -Werror -Wno-deprecated-declarations -Wno-stringop-truncation -Wno-restrict -Wno-unused-result -nostdlib -g -O2  GenFw.c -o GenFw.o
gcc  -c  -I .. -I ../Include/Common -I ../Include/ -I ../Include/IndustryStandard -I ../Common/ -I .. -I . -I ../Include/Ia32/  -MD -fshort-wchar -fno-strict-aliasing -Wall -Werror -Wno-deprecated-declarations -Wno-stringop-truncation -Wno-restrict -Wno-unused-result -nostdlib -g -O2  ElfConvert.c -o ElfConvert.o
gcc  -c  -I .. -I ../Include/Common -I ../Include/ -I ../Include/IndustryStandard -I ../Common/ -I .. -I . -I ../Include/Ia32/  -MD -fshort-wchar -fno-strict-aliasing -Wall -Werror -Wno-deprecated-declarations -Wno-stringop-truncation -Wno-restrict -Wno-unused-result -nostdlib -g -O2  Elf32Convert.c -o Elf32Convert.o
gcc  -c  -I .. -I ../Include/Common -I ../Include/ -I ../Include/IndustryStandard -I ../Common/ -I .. -I . -I ../Include/Ia32/  -MD -fshort-wchar -fno-strict-aliasing -Wall -Werror -Wno-deprecated-declarations -Wno-stringop-truncation -Wno-restrict -Wno-unused-result -nostdlib -g -O2  Elf64Convert.c -o Elf64Convert.o
gcc -o ../bin/GenFw  GenFw.o ElfConvert.o Elf32Convert.o Elf64Convert.o -L../libs -lCommon
gmake[2]: Leaving directory '/scratch/work/sysutils/ovmf/work/edk2-20181116/BaseTools/Source/C/GenFw'
gmake -C GenPage
gmake[2]: Entering directory '/scratch/work/sysutils/ovmf/work/edk2-20181116/BaseTools/Source/C/GenPage'
gcc  -c  -I .. -I ../Include/Common -I ../Include/ -I ../Include/IndustryStandard -I ../Common/ -I .. -I . -I ../Include/Ia32/  -MD -fshort-wchar -fno-strict-aliasing -Wall -Werror -Wno-deprecated-declarations -Wno-stringop-truncation -Wno-restrict -Wno-unused-result -nostdlib -g -O2  GenPage.c -o GenPage.o
gcc -o ../bin/GenPage  GenPage.o -L../libs -lCommon
gmake[2]: Leaving directory '/scratch/work/sysutils/ovmf/work/edk2-20181116/BaseTools/Source/C/GenPage'
gmake -C GenSec
gmake[2]: Entering directory '/scratch/work/sysutils/ovmf/work/edk2-20181116/BaseTools/Source/C/GenSec'
gcc  -c  -I .. -I ../Include/Common -I ../Include/ -I ../Include/IndustryStandard -I ../Common/ -I .. -I . -I ../Include/Ia32/  -MD -fshort-wchar -fno-strict-aliasing -Wall -Werror -Wno-deprecated-declarations -Wno-stringop-truncation -Wno-restrict -Wno-unused-result -nostdlib -g -O2  GenSec.c -o GenSec.o
gcc -o ../bin/GenSec  GenSec.o -L../libs -lCommon
gmake[2]: Leaving directory '/scratch/work/sysutils/ovmf/work/edk2-20181116/BaseTools/Source/C/GenSec'
gmake -C GenCrc32
gmake[2]: Entering directory '/scratch/work/sysutils/ovmf/work/edk2-20181116/BaseTools/Source/C/GenCrc32'
gcc  -c  -I .. -I ../Include/Common -I ../Include/ -I ../Include/IndustryStandard -I ../Common/ -I .. -I . -I ../Include/Ia32/  -MD -fshort-wchar -fno-strict-aliasing -Wall -Werror -Wno-deprecated-declarations -Wno-stringop-truncation -Wno-restrict -Wno-unused-result -nostdlib -g -O2  GenCrc32.c -o GenCrc32.o
gcc -o ../bin/GenCrc32  GenCrc32.o -L../libs -lCommon
gmake[2]: Leaving directory '/scratch/work/sysutils/ovmf/work/edk2-20181116/BaseTools/Source/C/GenCrc32'
gmake -C GenVtf
gmake[2]: Entering directory '/scratch/work/sysutils/ovmf/work/edk2-20181116/BaseTools/Source/C/GenVtf'
gcc  -c  -I .. -I ../Include/Common -I ../Include/ -I ../Include/IndustryStandard -I ../Common/ -I .. -I . -I ../Include/Ia32/  -MD -fshort-wchar -fno-strict-aliasing -Wall -Werror -Wno-deprecated-declarations -Wno-stringop-truncation -Wno-restrict -Wno-unused-result -nostdlib -g -O2  GenVtf.c -o GenVtf.o
gcc -o ../bin/GenVtf  GenVtf.o -L../libs -lCommon
gmake[2]: Leaving directory '/scratch/work/sysutils/ovmf/work/edk2-20181116/BaseTools/Source/C/GenVtf'
gmake -C LzmaCompress
gmake[2]: Entering directory '/scratch/work/sysutils/ovmf/work/edk2-20181116/BaseTools/Source/C/LzmaCompress'
gcc  -c  -I .. -I ../Include/Common -I ../Include/ -I ../Include/IndustryStandard -I ../Common/ -I .. -I . -I ../Include/Ia32/  -MD -fshort-wchar -fno-strict-aliasing -Wall -Werror -Wno-deprecated-declarations -Wno-stringop-truncation -Wno-restrict -Wno-unused-result -nostdlib -g -O2  -D_7ZIP_ST LzmaCompress.c -o LzmaCompress.o
gcc  -c  -I .. -I ../Include/Common -I ../Include/ -I ../Include/IndustryStandard -I ../Common/ -I .. -I . -I ../Include/Ia32/  -MD -fshort-wchar -fno-strict-aliasing -Wall -Werror -Wno-deprecated-declarations -Wno-stringop-truncation -Wno-restrict -Wno-unused-result -nostdlib -g -O2  -D_7ZIP_ST Sdk/C/Alloc.c -o Sdk/C/Alloc.o
gcc  -c  -I .. -I ../Include/Common -I ../Include/ -I ../Include/IndustryStandard -I ../Common/ -I .. -I . -I ../Include/Ia32/  -MD -fshort-wchar -fno-strict-aliasing -Wall -Werror -Wno-deprecated-declarations -Wno-stringop-truncation -Wno-restrict -Wno-unused-result -nostdlib -g -O2  -D_7ZIP_ST Sdk/C/LzFind.c -o Sdk/C/LzFind.o
gcc  -c  -I .. -I ../Include/Common -I ../Include/ -I ../Include/IndustryStandard -I ../Common/ -I .. -I . -I ../Include/Ia32/  -MD -fshort-wchar -fno-strict-aliasing -Wall -Werror -Wno-deprecated-declarations -Wno-stringop-truncation -Wno-restrict -Wno-unused-result -nostdlib -g -O2  -D_7ZIP_ST Sdk/C/LzmaDec.c -o Sdk/C/LzmaDec.o
gcc  -c  -I .. -I ../Include/Common -I ../Include/ -I ../Include/IndustryStandard -I ../Common/ -I .. -I . -I ../Include/Ia32/  -MD -fshort-wchar -fno-strict-aliasing -Wall -Werror -Wno-deprecated-declarations -Wno-stringop-truncation -Wno-restrict -Wno-unused-result -nostdlib -g -O2  -D_7ZIP_ST Sdk/C/LzmaEnc.c -o Sdk/C/LzmaEnc.o
gcc  -c  -I .. -I ../Include/Common -I ../Include/ -I ../Include/IndustryStandard -I ../Common/ -I .. -I . -I ../Include/Ia32/  -MD -fshort-wchar -fno-strict-aliasing -Wall -Werror -Wno-deprecated-declarations -Wno-stringop-truncation -Wno-restrict -Wno-unused-result -nostdlib -g -O2  -D_7ZIP_ST Sdk/C/7zFile.c -o Sdk/C/7zFile.o
gcc  -c  -I .. -I ../Include/Common -I ../Include/ -I ../Include/IndustryStandard -I ../Common/ -I .. -I . -I ../Include/Ia32/  -MD -fshort-wchar -fno-strict-aliasing -Wall -Werror -Wno-deprecated-declarations -Wno-stringop-truncation -Wno-restrict -Wno-unused-result -nostdlib -g -O2  -D_7ZIP_ST Sdk/C/7zStream.c -o Sdk/C/7zStream.o
gcc  -c  -I .. -I ../Include/Common -I ../Include/ -I ../Include/IndustryStandard -I ../Common/ -I .. -I . -I ../Include/Ia32/  -MD -fshort-wchar -fno-strict-aliasing -Wall -Werror -Wno-deprecated-declarations -Wno-stringop-truncation -Wno-restrict -Wno-unused-result -nostdlib -g -O2  -D_7ZIP_ST Sdk/C/Bra86.c -o Sdk/C/Bra86.o
gcc -o ../bin/LzmaCompress  LzmaCompress.o Sdk/C/Alloc.o Sdk/C/LzFind.o Sdk/C/LzmaDec.o Sdk/C/LzmaEnc.o Sdk/C/7zFile.o Sdk/C/7zStream.o Sdk/C/Bra86.o -L../libs 
gmake[2]: Leaving directory '/scratch/work/sysutils/ovmf/work/edk2-20181116/BaseTools/Source/C/LzmaCompress'
gmake -C Split
gmake[2]: Entering directory '/scratch/work/sysutils/ovmf/work/edk2-20181116/BaseTools/Source/C/Split'
gcc  -c  -I .. -I ../Include/Common -I ../Include/ -I ../Include/IndustryStandard -I ../Common/ -I .. -I . -I ../Include/Ia32/  -MD -fshort-wchar -fno-strict-aliasing -Wall -Werror -Wno-deprecated-declarations -Wno-stringop-truncation -Wno-restrict -Wno-unused-result -nostdlib -g -O2  Split.c -o Split.o
gcc -o ../bin/Split  Split.o -L../libs -lCommon
gmake[2]: Leaving directory '/scratch/work/sysutils/ovmf/work/edk2-20181116/BaseTools/Source/C/Split'
gmake -C TianoCompress
gmake[2]: Entering directory '/scratch/work/sysutils/ovmf/work/edk2-20181116/BaseTools/Source/C/TianoCompress'
gcc  -c  -I .. -I ../Include/Common -I ../Include/ -I ../Include/IndustryStandard -I ../Common/ -I .. -I . -I ../Include/Ia32/  -MD -fshort-wchar -fno-strict-aliasing -Wall -Werror -Wno-deprecated-declarations -Wno-stringop-truncation -Wno-restrict -Wno-unused-result -nostdlib -g -O2  TianoCompress.c -o TianoCompress.o
gcc -o ../bin/TianoCompress  TianoCompress.o -L../libs -lCommon
gmake[2]: Leaving directory '/scratch/work/sysutils/ovmf/work/edk2-20181116/BaseTools/Source/C/TianoCompress'
gmake -C VolInfo
gmake[2]: Entering directory '/scratch/work/sysutils/ovmf/work/edk2-20181116/BaseTools/Source/C/VolInfo'
gcc  -c  -I .. -I ../Include/Common -I ../Include/ -I ../Include/IndustryStandard -I ../Common/ -I .. -I . -I ../Include/Ia32/  -MD -fshort-wchar -fno-strict-aliasing -Wall -Werror -Wno-deprecated-declarations -Wno-stringop-truncation -Wno-restrict -Wno-unused-result -nostdlib -g -O2  VolInfo.c -o VolInfo.o
gcc -o ../bin/VolInfo  VolInfo.o -L../libs -lCommon
gmake[2]: Leaving directory '/scratch/work/sysutils/ovmf/work/edk2-20181116/BaseTools/Source/C/VolInfo'
gmake -C DevicePath
gmake[2]: Entering directory '/scratch/work/sysutils/ovmf/work/edk2-20181116/BaseTools/Source/C/DevicePath'
gcc  -c  -I .. -I ../Include/Common -I ../Include/ -I ../Include/IndustryStandard -I ../Common/ -I .. -I . -I ../Include/Ia32/  -MD -fshort-wchar -fno-strict-aliasing -Wall -Werror -Wno-deprecated-declarations -Wno-stringop-truncation -Wno-restrict -Wno-unused-result -nostdlib -g -O2  DevicePath.c -o DevicePath.o
gcc  -c  -I .. -I ../Include/Common -I ../Include/ -I ../Include/IndustryStandard -I ../Common/ -I .. -I . -I ../Include/Ia32/  -MD -fshort-wchar -fno-strict-aliasing -Wall -Werror -Wno-deprecated-declarations -Wno-stringop-truncation -Wno-restrict -Wno-unused-result -nostdlib -g -O2  UefiDevicePathLib.c -o UefiDevicePathLib.o
gcc  -c  -I .. -I ../Include/Common -I ../Include/ -I ../Include/IndustryStandard -I ../Common/ -I .. -I . -I ../Include/Ia32/  -MD -fshort-wchar -fno-strict-aliasing -Wall -Werror -Wno-deprecated-declarations -Wno-stringop-truncation -Wno-restrict -Wno-unused-result -nostdlib -g -O2  DevicePathFromText.c -o DevicePathFromText.o
gcc  -c  -I .. -I ../Include/Common -I ../Include/ -I ../Include/IndustryStandard -I ../Common/ -I .. -I . -I ../Include/Ia32/  -MD -fshort-wchar -fno-strict-aliasing -Wall -Werror -Wno-deprecated-declarations -Wno-stringop-truncation -Wno-restrict -Wno-unused-result -nostdlib -g -O2  DevicePathUtilities.c -o DevicePathUtilities.o
gcc -o ../bin/DevicePath  DevicePath.o UefiDevicePathLib.o DevicePathFromText.o  DevicePathUtilities.o -L../libs -lCommon
gmake[2]: Leaving directory '/scratch/work/sysutils/ovmf/work/edk2-20181116/BaseTools/Source/C/DevicePath'
Finished building BaseTools C Tools with HOST_ARCH=IA32
gmake[1]: Leaving directory '/scratch/work/sysutils/ovmf/work/edk2-20181116/BaseTools/Source/C'
gmake -C Source/Python
gmake[1]: Entering directory '/scratch/work/sysutils/ovmf/work/edk2-20181116/BaseTools/Source/Python'
gmake[1]: Nothing to be done for 'all'.
gmake[1]: Leaving directory '/scratch/work/sysutils/ovmf/work/edk2-20181116/BaseTools/Source/Python'
gmake -C Tests
gmake[1]: Entering directory '/scratch/work/sysutils/ovmf/work/edk2-20181116/BaseTools/Tests'
testHelp (TianoCompress.Tests) ... ok
testRandomDataCycles (TianoCompress.Tests) ... ok
test_AutoGen_AutoGen (CheckPythonSyntax.Tests) ... ok
test_AutoGen_BuildEngine (CheckPythonSyntax.Tests) ... ok
test_AutoGen_GenC (CheckPythonSyntax.Tests) ... ok
test_AutoGen_GenDepex (CheckPythonSyntax.Tests) ... ok
test_AutoGen_GenMake (CheckPythonSyntax.Tests) ... ok
test_AutoGen_GenPcdDb (CheckPythonSyntax.Tests) ... ok
test_AutoGen_GenVar (CheckPythonSyntax.Tests) ... ok
test_AutoGen_IdfClassObject (CheckPythonSyntax.Tests) ... ok
test_AutoGen_InfSectionParser (CheckPythonSyntax.Tests) ... ok
test_AutoGen_StrGather (CheckPythonSyntax.Tests) ... ok
test_AutoGen_UniClassObject (CheckPythonSyntax.Tests) ... ok
test_AutoGen_ValidCheckingInfoObject (CheckPythonSyntax.Tests) ... ok
test_AutoGen___init__ (CheckPythonSyntax.Tests) ... ok
test_BPDG_BPDG (CheckPythonSyntax.Tests) ... ok
test_BPDG_GenVpd (CheckPythonSyntax.Tests) ... ok
test_BPDG_StringTable (CheckPythonSyntax.Tests) ... ok
test_BPDG___init__ (CheckPythonSyntax.Tests) ... ok
test_Capsule_GenerateCapsule (CheckPythonSyntax.Tests) ... ok
test_CommonDataClass_CommonClass (CheckPythonSyntax.Tests) ... ok
test_CommonDataClass_DataClass (CheckPythonSyntax.Tests) ... ok
test_CommonDataClass_Exceptions (CheckPythonSyntax.Tests) ... ok
test_CommonDataClass_FdfClass (CheckPythonSyntax.Tests) ... ok
test_CommonDataClass___init__ (CheckPythonSyntax.Tests) ... ok
test_Common_BuildToolError (CheckPythonSyntax.Tests) ... ok
test_Common_BuildVersion (CheckPythonSyntax.Tests) ... ok
test_Common_DataType (CheckPythonSyntax.Tests) ... ok
test_Common_Edk2_Capsule_FmpPayloadHeader (CheckPythonSyntax.Tests) ... ok
test_Common_Edk2_Capsule___init__ (CheckPythonSyntax.Tests) ... ok
test_Common_Edk2___init__ (CheckPythonSyntax.Tests) ... ok
test_Common_EdkLogger (CheckPythonSyntax.Tests) ... ok
test_Common_Expression (CheckPythonSyntax.Tests) ... ok
test_Common_GlobalData (CheckPythonSyntax.Tests) ... ok
test_Common_Identification (CheckPythonSyntax.Tests) ... ok
test_Common_LongFilePathOs (CheckPythonSyntax.Tests) ... ok
test_Common_LongFilePathOsPath (CheckPythonSyntax.Tests) ... ok
test_Common_LongFilePathSupport (CheckPythonSyntax.Tests) ... ok
test_Common_Misc (CheckPythonSyntax.Tests) ... ok
test_Common_MultipleWorkspace (CheckPythonSyntax.Tests) ... ok
test_Common_Parsing (CheckPythonSyntax.Tests) ... ok
test_Common_RangeExpression (CheckPythonSyntax.Tests) ... ok
test_Common_StringUtils (CheckPythonSyntax.Tests) ... ok
test_Common_TargetTxtClassObject (CheckPythonSyntax.Tests) ... ok
test_Common_ToolDefClassObject (CheckPythonSyntax.Tests) ... ok
test_Common_Uefi_Capsule_FmpAuthHeader (CheckPythonSyntax.Tests) ... ok
test_Common_Uefi_Capsule_FmpCapsuleHeader (CheckPythonSyntax.Tests) ... ok
test_Common_Uefi_Capsule_UefiCapsuleHeader (CheckPythonSyntax.Tests) ... ok
test_Common_Uefi_Capsule___init__ (CheckPythonSyntax.Tests) ... ok
test_Common_Uefi___init__ (CheckPythonSyntax.Tests) ... ok
test_Common_VariableAttributes (CheckPythonSyntax.Tests) ... ok
test_Common_VpdInfoFile (CheckPythonSyntax.Tests) ... ok
test_Common___init__ (CheckPythonSyntax.Tests) ... ok
test_Common_caching (CheckPythonSyntax.Tests) ... ok
test_Ecc_CLexer (CheckPythonSyntax.Tests) ... ok
test_Ecc_CParser (CheckPythonSyntax.Tests) ... ok
test_Ecc_Check (CheckPythonSyntax.Tests) ... ok
test_Ecc_CodeFragment (CheckPythonSyntax.Tests) ... ok
test_Ecc_CodeFragmentCollector (CheckPythonSyntax.Tests) ... ok
test_Ecc_Configuration (CheckPythonSyntax.Tests) ... ok
test_Ecc_Database (CheckPythonSyntax.Tests) ... ok
test_Ecc_EccGlobalData (CheckPythonSyntax.Tests) ... ok
test_Ecc_EccMain (CheckPythonSyntax.Tests) ... ok
test_Ecc_EccToolError (CheckPythonSyntax.Tests) ... ok
test_Ecc_Exception (CheckPythonSyntax.Tests) ... ok
test_Ecc_FileProfile (CheckPythonSyntax.Tests) ... ok
test_Ecc_MetaDataParser (CheckPythonSyntax.Tests) ... ok
test_Ecc_MetaFileWorkspace_MetaDataTable (CheckPythonSyntax.Tests) ... ok
test_Ecc_MetaFileWorkspace_MetaFileParser (CheckPythonSyntax.Tests) ... ok
test_Ecc_MetaFileWorkspace_MetaFileTable (CheckPythonSyntax.Tests) ... ok
test_Ecc_MetaFileWorkspace___init__ (CheckPythonSyntax.Tests) ... ok
test_Ecc_ParserWarning (CheckPythonSyntax.Tests) ... ok
test_Ecc_Xml_XmlRoutines (CheckPythonSyntax.Tests) ... ok
test_Ecc_Xml___init__ (CheckPythonSyntax.Tests) ... ok
test_Ecc___init__ (CheckPythonSyntax.Tests) ... ok
test_Ecc_c (CheckPythonSyntax.Tests) ... ok
test_Eot_CLexer (CheckPythonSyntax.Tests) ... ok
test_Eot_CParser (CheckPythonSyntax.Tests) ... ok
test_Eot_CodeFragment (CheckPythonSyntax.Tests) ... ok
test_Eot_CodeFragmentCollector (CheckPythonSyntax.Tests) ... ok
test_Eot_Database (CheckPythonSyntax.Tests) ... ok
test_Eot_EotGlobalData (CheckPythonSyntax.Tests) ... ok
test_Eot_EotMain (CheckPythonSyntax.Tests) ... ok
test_Eot_EotToolError (CheckPythonSyntax.Tests) ... ok
test_Eot_FileProfile (CheckPythonSyntax.Tests) ... ok
test_Eot_InfParserLite (CheckPythonSyntax.Tests) ... ok
test_Eot_Parser (CheckPythonSyntax.Tests) ... ok
test_Eot_ParserWarning (CheckPythonSyntax.Tests) ... ok
test_Eot_Report (CheckPythonSyntax.Tests) ... ok
test_Eot___init__ (CheckPythonSyntax.Tests) ... ok
test_Eot_c (CheckPythonSyntax.Tests) ... ok
test_GenFds_AprioriSection (CheckPythonSyntax.Tests) ... ok
test_GenFds_Capsule (CheckPythonSyntax.Tests) ... ok
test_GenFds_CapsuleData (CheckPythonSyntax.Tests) ... ok
test_GenFds_ComponentStatement (CheckPythonSyntax.Tests) ... ok
test_GenFds_CompressSection (CheckPythonSyntax.Tests) ... ok
test_GenFds_DataSection (CheckPythonSyntax.Tests) ... ok
test_GenFds_DepexSection (CheckPythonSyntax.Tests) ... ok
test_GenFds_EfiSection (CheckPythonSyntax.Tests) ... ok
test_GenFds_Fd (CheckPythonSyntax.Tests) ... ok
test_GenFds_FdfParser (CheckPythonSyntax.Tests) ... ok
test_GenFds_Ffs (CheckPythonSyntax.Tests) ... ok
test_GenFds_FfsFileStatement (CheckPythonSyntax.Tests) ... ok
test_GenFds_FfsInfStatement (CheckPythonSyntax.Tests) ... ok
test_GenFds_Fv (CheckPythonSyntax.Tests) ... ok
test_GenFds_FvImageSection (CheckPythonSyntax.Tests) ... ok
test_GenFds_GenFds (CheckPythonSyntax.Tests) ... ok
test_GenFds_GenFdsGlobalVariable (CheckPythonSyntax.Tests) ... ok
test_GenFds_GuidSection (CheckPythonSyntax.Tests) ... ok
test_GenFds_OptRomFileStatement (CheckPythonSyntax.Tests) ... ok
test_GenFds_OptRomInfStatement (CheckPythonSyntax.Tests) ... ok
test_GenFds_OptionRom (CheckPythonSyntax.Tests) ... ok
test_GenFds_Region (CheckPythonSyntax.Tests) ... ok
test_GenFds_Rule (CheckPythonSyntax.Tests) ... ok
test_GenFds_RuleComplexFile (CheckPythonSyntax.Tests) ... ok
test_GenFds_RuleSimpleFile (CheckPythonSyntax.Tests) ... ok
test_GenFds_Section (CheckPythonSyntax.Tests) ... ok
test_GenFds_UiSection (CheckPythonSyntax.Tests) ... ok
test_GenFds_VerSection (CheckPythonSyntax.Tests) ... ok
test_GenFds_Vtf (CheckPythonSyntax.Tests) ... ok
test_GenFds___init__ (CheckPythonSyntax.Tests) ... ok
test_GenPatchPcdTable_GenPatchPcdTable (CheckPythonSyntax.Tests) ... ok
test_GenPatchPcdTable___init__ (CheckPythonSyntax.Tests) ... ok
test_PatchPcdValue_PatchPcdValue (CheckPythonSyntax.Tests) ... ok
test_PatchPcdValue___init__ (CheckPythonSyntax.Tests) ... ok
test_Pkcs7Sign_Pkcs7Sign (CheckPythonSyntax.Tests) ... ok
test_Rsa2048Sha256Sign_Rsa2048Sha256GenerateKeys (CheckPythonSyntax.Tests) ... ok
test_Rsa2048Sha256Sign_Rsa2048Sha256Sign (CheckPythonSyntax.Tests) ... ok
test_Table_Table (CheckPythonSyntax.Tests) ... ok
test_Table_TableDataModel (CheckPythonSyntax.Tests) ... ok
test_Table_TableDec (CheckPythonSyntax.Tests) ... ok
test_Table_TableDsc (CheckPythonSyntax.Tests) ... ok
test_Table_TableEotReport (CheckPythonSyntax.Tests) ... ok
test_Table_TableFdf (CheckPythonSyntax.Tests) ... ok
test_Table_TableFile (CheckPythonSyntax.Tests) ... ok
test_Table_TableFunction (CheckPythonSyntax.Tests) ... ok
test_Table_TableIdentifier (CheckPythonSyntax.Tests) ... ok
test_Table_TableInf (CheckPythonSyntax.Tests) ... ok
test_Table_TablePcd (CheckPythonSyntax.Tests) ... ok
test_Table_TableQuery (CheckPythonSyntax.Tests) ... ok
test_Table_TableReport (CheckPythonSyntax.Tests) ... ok
test_Table___init__ (CheckPythonSyntax.Tests) ... ok
test_TargetTool_TargetTool (CheckPythonSyntax.Tests) ... ok
test_TargetTool___init__ (CheckPythonSyntax.Tests) ... ok
test_Trim_Trim (CheckPythonSyntax.Tests) ... ok
test_UPT_BuildVersion (CheckPythonSyntax.Tests) ... ok
test_UPT_Core_DependencyRules (CheckPythonSyntax.Tests) ... ok
test_UPT_Core_DistributionPackageClass (CheckPythonSyntax.Tests) ... ok
test_UPT_Core_FileHook (CheckPythonSyntax.Tests) ... ok
test_UPT_Core_IpiDb (CheckPythonSyntax.Tests) ... ok
test_UPT_Core_PackageFile (CheckPythonSyntax.Tests) ... ok
test_UPT_Core___init__ (CheckPythonSyntax.Tests) ... ok
test_UPT_GenMetaFile_GenDecFile (CheckPythonSyntax.Tests) ... ok
test_UPT_GenMetaFile_GenInfFile (CheckPythonSyntax.Tests) ... ok
test_UPT_GenMetaFile_GenMetaFileMisc (CheckPythonSyntax.Tests) ... ok
test_UPT_GenMetaFile_GenXmlFile (CheckPythonSyntax.Tests) ... ok
test_UPT_GenMetaFile___init__ (CheckPythonSyntax.Tests) ... ok
test_UPT_InstallPkg (CheckPythonSyntax.Tests) ... ok
test_UPT_InventoryWs (CheckPythonSyntax.Tests) ... ok
test_UPT_Library_CommentGenerating (CheckPythonSyntax.Tests) ... ok
test_UPT_Library_CommentParsing (CheckPythonSyntax.Tests) ... ok
test_UPT_Library_DataType (CheckPythonSyntax.Tests) ... ok
test_UPT_Library_ExpressionValidate (CheckPythonSyntax.Tests) ... ok
test_UPT_Library_GlobalData (CheckPythonSyntax.Tests) ... ok
test_UPT_Library_Misc (CheckPythonSyntax.Tests) ... ok
test_UPT_Library_ParserValidate (CheckPythonSyntax.Tests) ... ok
test_UPT_Library_Parsing (CheckPythonSyntax.Tests) ... ok
test_UPT_Library_StringUtils (CheckPythonSyntax.Tests) ... ok
test_UPT_Library_UniClassObject (CheckPythonSyntax.Tests) ... ok
test_UPT_Library_Xml_XmlRoutines (CheckPythonSyntax.Tests) ... ok
test_UPT_Library_Xml___init__ (CheckPythonSyntax.Tests) ... ok
test_UPT_Library___init__ (CheckPythonSyntax.Tests) ... ok
test_UPT_Logger_Log (CheckPythonSyntax.Tests) ... ok
test_UPT_Logger_StringTable (CheckPythonSyntax.Tests) ... ok
test_UPT_Logger_ToolError (CheckPythonSyntax.Tests) ... ok
test_UPT_Logger___init__ (CheckPythonSyntax.Tests) ... ok
test_UPT_MkPkg (CheckPythonSyntax.Tests) ... ok
test_UPT_Object_POM_CommonObject (CheckPythonSyntax.Tests) ... ok
test_UPT_Object_POM_ModuleObject (CheckPythonSyntax.Tests) ... ok
test_UPT_Object_POM_PackageObject (CheckPythonSyntax.Tests) ... ok
test_UPT_Object_POM___init__ (CheckPythonSyntax.Tests) ... ok
test_UPT_Object_Parser_DecObject (CheckPythonSyntax.Tests) ... ok
test_UPT_Object_Parser_InfBinaryObject (CheckPythonSyntax.Tests) ... ok
test_UPT_Object_Parser_InfBuildOptionObject (CheckPythonSyntax.Tests) ... ok
test_UPT_Object_Parser_InfCommonObject (CheckPythonSyntax.Tests) ... ok
test_UPT_Object_Parser_InfDefineCommonObject (CheckPythonSyntax.Tests) ... ok
test_UPT_Object_Parser_InfDefineObject (CheckPythonSyntax.Tests) ... ok
test_UPT_Object_Parser_InfDepexObject (CheckPythonSyntax.Tests) ... ok
test_UPT_Object_Parser_InfGuidObject (CheckPythonSyntax.Tests) ... ok
test_UPT_Object_Parser_InfHeaderObject (CheckPythonSyntax.Tests) ... ok
test_UPT_Object_Parser_InfLibraryClassesObject (CheckPythonSyntax.Tests) ... ok
test_UPT_Object_Parser_InfMisc (CheckPythonSyntax.Tests) ... ok
test_UPT_Object_Parser_InfPackagesObject (CheckPythonSyntax.Tests) ... ok
test_UPT_Object_Parser_InfPcdObject (CheckPythonSyntax.Tests) ... ok
test_UPT_Object_Parser_InfPpiObject (CheckPythonSyntax.Tests) ... ok
test_UPT_Object_Parser_InfProtocolObject (CheckPythonSyntax.Tests) ... ok
test_UPT_Object_Parser_InfSoucesObject (CheckPythonSyntax.Tests) ... ok
test_UPT_Object_Parser_InfUserExtensionObject (CheckPythonSyntax.Tests) ... ok
test_UPT_Object_Parser___init__ (CheckPythonSyntax.Tests) ... ok
test_UPT_Object___init__ (CheckPythonSyntax.Tests) ... ok
test_UPT_Parser_DecParser (CheckPythonSyntax.Tests) ... ok
test_UPT_Parser_DecParserMisc (CheckPythonSyntax.Tests) ... ok
test_UPT_Parser_InfAsBuiltProcess (CheckPythonSyntax.Tests) ... ok
test_UPT_Parser_InfBinarySectionParser (CheckPythonSyntax.Tests) ... ok
test_UPT_Parser_InfBuildOptionSectionParser (CheckPythonSyntax.Tests) ... ok
test_UPT_Parser_InfDefineSectionParser (CheckPythonSyntax.Tests) ... ok
test_UPT_Parser_InfDepexSectionParser (CheckPythonSyntax.Tests) ... ok
test_UPT_Parser_InfGuidPpiProtocolSectionParser (CheckPythonSyntax.Tests) ... ok
test_UPT_Parser_InfLibrarySectionParser (CheckPythonSyntax.Tests) ... ok
test_UPT_Parser_InfPackageSectionParser (CheckPythonSyntax.Tests) ... ok
test_UPT_Parser_InfParser (CheckPythonSyntax.Tests) ... ok
test_UPT_Parser_InfParserMisc (CheckPythonSyntax.Tests) ... ok
test_UPT_Parser_InfPcdSectionParser (CheckPythonSyntax.Tests) ... ok
test_UPT_Parser_InfSectionParser (CheckPythonSyntax.Tests) ... ok
test_UPT_Parser_InfSourceSectionParser (CheckPythonSyntax.Tests) ... ok
test_UPT_Parser___init__ (CheckPythonSyntax.Tests) ... ok
test_UPT_PomAdapter_DecPomAlignment (CheckPythonSyntax.Tests) ... ok
test_UPT_PomAdapter_InfPomAlignment (CheckPythonSyntax.Tests) ... ok
test_UPT_PomAdapter_InfPomAlignmentMisc (CheckPythonSyntax.Tests) ... ok
test_UPT_PomAdapter___init__ (CheckPythonSyntax.Tests) ... ok
test_UPT_ReplacePkg (CheckPythonSyntax.Tests) ... ok
test_UPT_RmPkg (CheckPythonSyntax.Tests) ... ok
test_UPT_TestInstall (CheckPythonSyntax.Tests) ... ok
test_UPT_UPT (CheckPythonSyntax.Tests) ... ok
test_UPT_UnitTest_CommentGeneratingUnitTest (CheckPythonSyntax.Tests) ... ok
test_UPT_UnitTest_CommentParsingUnitTest (CheckPythonSyntax.Tests) ... ok
test_UPT_UnitTest_DecParserTest (CheckPythonSyntax.Tests) ... ok
test_UPT_UnitTest_DecParserUnitTest (CheckPythonSyntax.Tests) ... ok
test_UPT_UnitTest_InfBinarySectionTest (CheckPythonSyntax.Tests) ... ok
test_UPT_Xml_CommonXml (CheckPythonSyntax.Tests) ... ok
test_UPT_Xml_GuidProtocolPpiXml (CheckPythonSyntax.Tests) ... ok
test_UPT_Xml_IniToXml (CheckPythonSyntax.Tests) ... ok
test_UPT_Xml_ModuleSurfaceAreaXml (CheckPythonSyntax.Tests) ... ok
test_UPT_Xml_PackageSurfaceAreaXml (CheckPythonSyntax.Tests) ... ok
test_UPT_Xml_PcdXml (CheckPythonSyntax.Tests) ... ok
test_UPT_Xml_XmlParser (CheckPythonSyntax.Tests) ... ok
test_UPT_Xml_XmlParserMisc (CheckPythonSyntax.Tests) ... ok
test_UPT_Xml___init__ (CheckPythonSyntax.Tests) ... ok
test_Workspace_BuildClassObject (CheckPythonSyntax.Tests) ... ok
test_Workspace_DecBuildData (CheckPythonSyntax.Tests) ... ok
test_Workspace_DscBuildData (CheckPythonSyntax.Tests) ... ok
test_Workspace_InfBuildData (CheckPythonSyntax.Tests) ... ok
test_Workspace_MetaDataTable (CheckPythonSyntax.Tests) ... ok
test_Workspace_MetaFileCommentParser (CheckPythonSyntax.Tests) ... ok
test_Workspace_MetaFileParser (CheckPythonSyntax.Tests) ... ok
test_Workspace_MetaFileTable (CheckPythonSyntax.Tests) ... ok
test_Workspace_WorkspaceCommon (CheckPythonSyntax.Tests) ... ok
test_Workspace_WorkspaceDatabase (CheckPythonSyntax.Tests) ... ok
test_Workspace___init__ (CheckPythonSyntax.Tests) ... ok
test_build_BuildReport (CheckPythonSyntax.Tests) ... ok
test_build___init__ (CheckPythonSyntax.Tests) ... ok
test_build_build (CheckPythonSyntax.Tests) ... ok
test_sitecustomize (CheckPythonSyntax.Tests) ... ok
test32bitUnicodeCharInUtf8Comment (CheckUnicodeSourceFiles.Tests) ... ok
test32bitUnicodeCharInUtf8File (CheckUnicodeSourceFiles.Tests) ... ok
testSupplementaryPlaneUnicodeCharInUtf16File (CheckUnicodeSourceFiles.Tests) ... ok
testSurrogatePairUnicodeCharInUtf16File (CheckUnicodeSourceFiles.Tests) ... ok
testSurrogatePairUnicodeCharInUtf8File (CheckUnicodeSourceFiles.Tests) ... ok
testSurrogatePairUnicodeCharInUtf8FileWithBom (CheckUnicodeSourceFiles.Tests) ... ok
testUtf16InUniFile (CheckUnicodeSourceFiles.Tests) ... ok
testValidUtf8File (CheckUnicodeSourceFiles.Tests) ... ok
testValidUtf8FileWithBom (CheckUnicodeSourceFiles.Tests) ... ok

----------------------------------------------------------------------
Ran 262 tests in 4.120s

OK
gmake[1]: Leaving directory '/scratch/work/sysutils/ovmf/work/edk2-20181116/BaseTools/Tests'
gmake: Leaving directory '/scratch/work/sysutils/ovmf/work/edk2-20181116/BaseTools'
Running edk2 build for OvmfPkgIa32
Build environment: NetBSD-9.0-i386-32bit-ELF
Build start time: 09:58:57, Oct.27 2023

WORKSPACE        = /scratch/work/sysutils/ovmf/work/edk2-20181116
ECP_SOURCE       = /scratch/work/sysutils/ovmf/work/edk2-20181116/EdkCompatibilityPkg
EDK_SOURCE       = /scratch/work/sysutils/ovmf/work/edk2-20181116/EdkCompatibilityPkg
EFI_SOURCE       = /scratch/work/sysutils/ovmf/work/edk2-20181116/EdkCompatibilityPkg
EDK_TOOLS_PATH   = /scratch/work/sysutils/ovmf/work/edk2-20181116/BaseTools
CONF_PATH        = /scratch/work/sysutils/ovmf/work/edk2-20181116/Conf


Architecture(s)  = IA32
Build target     = DEBUG
Toolchain        = GCC49

Active Platform          = /scratch/work/sysutils/ovmf/work/edk2-20181116/OvmfPkg/OvmfPkgIa32.dsc
Flash Image Definition   = /scratch/work/sysutils/ovmf/work/edk2-20181116/OvmfPkg/OvmfPkgIa32.fdf

Processing meta-data .................................................. done!
Building ... /scratch/work/sysutils/ovmf/work/edk2-20181116/OvmfPkg/ResetVector/ResetVector.inf [IA32]
"gcc" -E -x assembler-with-cpp -include /scratch/work/sysutils/ovmf/work/edk2-20181116/Build/OvmfIa32/DEBUG_GCC49/IA32/OvmfPkg/ResetVector/ResetVector/DEBUG/AutoGen.h -I/scratch/work/sysutils/ovmf/work/edk2-20181116/OvmfPkg/ResetVector -I/scratch/work/sysutils/ovmf/work/edk2-20181116/Build/OvmfIa32/DEBUG_GCC49/IA32/OvmfPkg/ResetVector/ResetVector/DEBUG -I/scratch/work/sysutils/ovmf/work/edk2-20181116/OvmfPkg -I/scratch/work/sysutils/ovmf/work/edk2-20181116/OvmfPkg/Include -I/scratch/work/sysutils/ovmf/work/edk2-20181116/MdePkg -I/scratch/work/sysutils/ovmf/work/edk2-20181116/MdePkg/Include -I/scratch/work/sysutils/ovmf/work/edk2-20181116/MdePkg/Include/Ia32 -I/scratch/work/sysutils/ovmf/work/edk2-20181116/UefiCpuPkg -I/scratch/work/sysutils/ovmf/work/edk2-20181116/UefiCpuPkg/Include /scratch/work/sysutils/ovmf/work/edk2-20181116/OvmfPkg/ResetVector/ResetVector.nasmb > /scratch/work/sysutils/ovmf/work/edk2-20181116/Build/OvmfIa32/DEBUG_GCC49/IA32/OvmfPkg/ResetVector/ResetVector/OUTPUT/ResetVector.i
Trim --source-code --convert-hex -o /scratch/work/sysutils/ovmf/work/edk2-20181116/Build/OvmfIa32/DEBUG_GCC49/IA32/OvmfPkg/ResetVector/ResetVector/OUTPUT/ResetVector.iii /scratch/work/sysutils/ovmf/work/edk2-20181116/Build/OvmfIa32/DEBUG_GCC49/IA32/OvmfPkg/ResetVector/ResetVector/OUTPUT/ResetVector.i
"nasm" -I/scratch/work/sysutils/ovmf/work/edk2-20181116/OvmfPkg/ResetVector/ -l /scratch/work/sysutils/ovmf/work/edk2-20181116/Build/OvmfIa32/DEBUG_GCC49/IA32/OvmfPkg/ResetVector/ResetVector/OUTPUT/ResetVector.lst -f bin -I/scratch/work/sysutils/ovmf/work/edk2-20181116/UefiCpuPkg/ResetVector/Vtf0/ -o /scratch/work/sysutils/ovmf/work/edk2-20181116/Build/OvmfIa32/DEBUG_GCC49/IA32/OvmfPkg/ResetVector/ResetVector/OUTPUT/ResetVector.bin /scratch/work/sysutils/ovmf/work/edk2-20181116/Build/OvmfIa32/DEBUG_GCC49/IA32/OvmfPkg/ResetVector/ResetVector/OUTPUT/ResetVector.iii
cp -f /scratch/work/sysutils/ovmf/work/edk2-20181116/Build/OvmfIa32/DEBUG_GCC49/IA32/OvmfPkg/ResetVector/ResetVector/OUTPUT/ResetVector.bin /scratch/work/sysutils/ovmf/work/edk2-20181116/Build/OvmfIa32/DEBUG_GCC49/IA32/OvmfPkg/ResetVector/ResetVector/OUTPUT/ResetVector.com
Building ... /scratch/work/sysutils/ovmf/work/edk2-20181116/OvmfPkg/AcpiTables/AcpiTables.inf [IA32]
"gcc" -c -o /scratch/work/sysutils/ovmf/work/edk2-20181116/Build/OvmfIa32/DEBUG_GCC49/IA32/OvmfPkg/AcpiTables/AcpiTables/OUTPUT/./Facs.obj -g -fshort-wchar -fno-builtin -fno-strict-aliasing -Wall -Werror -Wno-array-bounds -ffunction-sections -fdata-sections -include AutoGen.h -fno-common -DSTRING_ARRAY_NAME=PlatformAcpiTablesStrings -m32 -march=i586 -malign-double -fno-stack-protector -D EFI32 -fno-asynchronous-unwind-tables -Wno-address -Os -mno-mmx -mno-sse -D DISABLE_NEW_DEPRECATED_INTERFACES -x c -m32 -I/scratch/work/sysutils/ovmf/work/edk2-20181116/OvmfPkg/AcpiTables -I/scratch/work/sysutils/ovmf/work/edk2-20181116/Build/OvmfIa32/DEBUG_GCC49/IA32/OvmfPkg/AcpiTables/AcpiTables/DEBUG -I/scratch/work/sysutils/ovmf/work/edk2-20181116/MdePkg -I/scratch/work/sysutils/ovmf/work/edk2-20181116/MdePkg/Include -I/scratch/work/sysutils/ovmf/work/edk2-20181116/MdePkg/Include/Ia32 -I/scratch/work/sysutils/ovmf/work/edk2-20181116/OvmfPkg -I/scratch/work/sysutils/ovmf/work/edk2-20181116/OvmfPkg/Include /scratch/work/sysutils/ovmf/work/edk2-20181116/OvmfPkg/AcpiTables/Facs.aslc
"gcc" -o /scratch/work/sysutils/ovmf/work/edk2-20181116/Build/OvmfIa32/DEBUG_GCC49/IA32/OvmfPkg/AcpiTables/AcpiTables/OUTPUT/./Facs.dll -nostdlib -Wl,-n,-q,--gc-sections -z common-page-size=0x40 -Wl,--defsym=PECOFF_HEADER_SIZE=0 -Wl,--script=/scratch/work/sysutils/ovmf/work/edk2-20181116/BaseTools/Scripts/GccBase.lds -Wl,--entry,ReferenceAcpiTable -u ReferenceAcpiTable -Wl,-m,elf_i386 /scratch/work/sysutils/ovmf/work/edk2-20181116/Build/OvmfIa32/DEBUG_GCC49/IA32/OvmfPkg/AcpiTables/AcpiTables/OUTPUT/./Facs.obj
"GenFw" -o /scratch/work/sysutils/ovmf/work/edk2-20181116/Build/OvmfIa32/DEBUG_GCC49/IA32/OvmfPkg/AcpiTables/AcpiTables/OUTPUT/./Facs.acpi -c /scratch/work/sysutils/ovmf/work/edk2-20181116/Build/OvmfIa32/DEBUG_GCC49/IA32/OvmfPkg/AcpiTables/AcpiTables/OUTPUT/./Facs.dll
GenFw: ERROR 3000: Invalid
  /scratch/work/sysutils/ovmf/work/edk2-20181116/Build/OvmfIa32/DEBUG_GCC49/IA32/OvmfPkg/AcpiTables/AcpiTables/OUTPUT/./Facs.dll unsupported ELF EM_386 relocation 0xa.
GenFw: ERROR 3000: Invalid
  /scratch/work/sysutils/ovmf/work/edk2-20181116/Build/OvmfIa32/DEBUG_GCC49/IA32/OvmfPkg/AcpiTables/AcpiTables/OUTPUT/./Facs.dll unsupported ELF EM_386 relocation 0x9.
GenFw: ERROR 3000: Invalid
  /scratch/work/sysutils/ovmf/work/edk2-20181116/Build/OvmfIa32/DEBUG_GCC49/IA32/OvmfPkg/AcpiTables/AcpiTables/OUTPUT/./Facs.dll unsupported ELF EM_386 relocation 0xa.
GenFw: ERROR 3000: Invalid
  /scratch/work/sysutils/ovmf/work/edk2-20181116/Build/OvmfIa32/DEBUG_GCC49/IA32/OvmfPkg/AcpiTables/AcpiTables/OUTPUT/./Facs.dll unsupported ELF EM_386 relocation 0x9.
make: *** [GNUmakefile:336: /scratch/work/sysutils/ovmf/work/edk2-20181116/Build/OvmfIa32/DEBUG_GCC49/IA32/OvmfPkg/AcpiTables/AcpiTables/OUTPUT/Facs.acpi] Error 2


build.py...
 : error 7000: Failed to execute command
	make tbuild [/scratch/work/sysutils/ovmf/work/edk2-20181116/Build/OvmfIa32/DEBUG_GCC49/IA32/OvmfPkg/AcpiTables/AcpiTables]


build.py...
 : error F002: Failed to build module
	/scratch/work/sysutils/ovmf/work/edk2-20181116/OvmfPkg/AcpiTables/AcpiTables.inf [IA32, GCC49, DEBUG]

- Failed -
Build end time: 10:00:08, Oct.27 2023
Build total time: 00:01:11

*** Error code 1

Stop.
make[1]: stopped in /tree/pkgsrc/sysutils/ovmf
*** Error code 1

Stop.
make: stopped in /tree/pkgsrc/sysutils/ovmf