=> Bootstrap dependency digest>=20211023: found digest-20220214
===> Skipping vulnerability checks.
WARNING: No /usr/pkg/pkgdb/pkg-vulnerabilities file found.
WARNING: To fix run: `/usr/sbin/pkg_admin -K /usr/pkg/pkgdb fetch-pkg-vulnerabilities'.
===> Building for jack-1.9.21nb3
cd /scratch/work/audio/jack/work/jack2-1.9.21 && /usr/bin/env CC=gcc CFLAGS=-O2\ \ -I/usr/include\ -I/usr/pkg/include/python3.11\ -I/usr/pkg/include CXX=c++ CXXFLAGS=-O2\ -I/usr/include\ -I/usr/pkg/include/python3.11\ -I/usr/pkg/include DESTDIR=/scratch/work/audio/jack/work/.destdir LINKFLAGS=\ \ \ -Wl,-zrelro\ -L/usr/lib\ -Wl,-R/usr/lib\ -L/usr/pkg/lib\ -Wl,-R/usr/pkg/lib PATH=/scratch/work/audio/jack/work/.cwrapper/bin:/scratch/work/audio/jack/work/.buildlink/bin:/scratch/work/audio/jack/work/.gcc/bin:/scratch/work/audio/jack/work/.tools/bin:/usr/pkg/bin:/sbin:/bin:/usr/sbin:/usr/bin PREFIX=/usr/pkg JOBS=5 ./waf --systemd=no --readline=no --example-tools=yes --mandir=/usr/pkg/man --libdir=/usr/pkg/lib
Waf: Entering directory `/scratch/work/audio/jack/work/jack2-1.9.21/build'
[  1/231] Compiling posix/JackSocket.cpp
[  2/231] Compiling common/JackEngineControl.cpp
[  3/231] Compiling common/JackException.cpp
[  4/231] Compiling common/JackClient.cpp
[  5/231] Compiling common/JackActivationCount.cpp
[  6/231] Compiling posix/JackPosixMutex.cpp
In file included from ../common/JackActivationCount.cpp:21:0:
../common/JackActivationCount.h: In constructor 'Jack::JackActivationCount::JackActivationCount()':
../common/JackActivationCount.h:49:55: error: expected primary-expression before ',' token
             static_assert(offsetof(JackActivationCount, fValue) % sizeof(fValue) == 0,
                                                       ^
../common/JackActivationCount.h:49:63: error: 'offsetof' was not declared in this scope
             static_assert(offsetof(JackActivationCount, fValue) % sizeof(fValue) == 0,
                                                               ^

In file included from ../common/JackConnectionManager.h:24:0,
                 from ../common/JackGraphManager.h:27,
                 from ../common/JackClient.cpp:22:
../common/JackActivationCount.h: In constructor 'Jack::JackActivationCount::JackActivationCount()':
../common/JackActivationCount.h:49:55: error: expected primary-expression before ',' token
             static_assert(offsetof(JackActivationCount, fValue) % sizeof(fValue) == 0,
                                                       ^
../common/JackActivationCount.h:49:63: error: 'offsetof' was not declared in this scope
             static_assert(offsetof(JackActivationCount, fValue) % sizeof(fValue) == 0,
                                                               ^

Waf: Leaving directory `/scratch/work/audio/jack/work/jack2-1.9.21/build'
Build failed
 -> task in 'clientlib' failed with exit status 1 (run with -v to display more information)
 -> task in 'clientlib' failed with exit status 1 (run with -v to display more information)
*** Error code 1

Stop.
make[1]: stopped in /tree/pkgsrc/audio/jack
*** Error code 1

Stop.
make: stopped in /tree/pkgsrc/audio/jack